program: Orca
programVersion: 6.1.x
elementType: Au C C C C H C H H C P C C H C H H H H H H H H H H H H C C C C H C H C H H C H H H
elementType: Au
keywords: optts freq wb97x-d3bj def2-tzvp(-f) def2/J tightopt verytightscf
charge: 1
multiplicity: 1
frequency: 0.00 0.00 0.00 0.00 0.00 0.00 -382.80 14.24 18.39 30.37 41.08 41.72 49.13 99.78 118.85 134.78 154.33 175.76 179.47 183.79 192.44 201.43 217.63 218.92 220.58 223.95 256.78 257.58 321.63 347.55 371.73 379.21 388.62 444.24 476.40 530.94 539.35 563.98 625.34 682.24 694.26 706.90 723.29 733.82 778.66 779.16 807.71 808.75 837.41 854.84 873.35 874.79 875.47 903.99 924.91 929.06 957.32 973.83 974.37 979.88 996.43 1004.44 1018.53 1019.00 1026.03 1032.47 1046.70 1075.15 1132.98 1142.94 1183.48 1204.22 1213.64 1254.50 1298.47 1314.73 1333.20 1336.84 1337.38 1349.67 1359.09 1383.96 1419.66 1443.61 1446.26 1446.85 1447.09 1453.76 1454.67 1460.77 1463.15 1464.68 1475.66 1501.52 1511.01 1544.84 1644.45 1672.70 1689.11 1837.10 3065.07 3074.20 3074.79 3075.09 3097.60 3115.16 3128.80 3149.47 3153.14 3165.17 3165.34 3166.04 3172.11 3172.65 3172.75 3173.34 3175.41 3196.31 3208.80 3213.39 3229.61 3266.26 3368.28
frequency: 14.24 18.39 30.37 41.08 41.72 49.13 99.78 118.85 134.78 154.33 175.76 179.47 183.79 192.44 201.43 217.63 218.92 220.58 223.95 256.78 257.58 321.63 347.55 371.73 379.21 388.62 444.24 476.40 530.94 539.35 563.98 625.34 682.24 694.26 706.90 723.29 733.82 778.66 779.16 807.71 808.75 837.41 854.84 873.35 874.79 875.47 903.99 924.91 929.06 957.32 973.83 974.37 979.88 996.43 1004.44 1018.53 1019.00 1026.03 1032.47 1046.70 1075.15 1132.98 1142.94 1183.48 1204.22 1213.64 1254.50 1298.47 1314.73 1333.20 1336.84 1337.38 1349.67 1359.09 1383.96 1419.66 1443.61 1446.26 1446.85 1447.09 1453.76 1454.67 1460.77 1463.15 1464.68 1475.66 1501.52 1511.01 1544.84 1644.45 1672.70 1689.11 1837.10 3065.07 3074.20 3074.79 3075.09 3097.60 3115.16 3128.80 3149.47 3153.14 3165.17 3165.34 3166.04 3172.11 3172.65 3172.75 3173.34 3175.41 3196.31 3208.80 3213.39 3229.61 3266.26 3368.28
formula: C16H23AuP
InChI: InChI=1/C13H14.C3H9P.Au/c1-4-5-8-12(3)13-9-6-7-11(2)10-13;1-4(2)3;/h1,6-7,9-10H,3,5,8H2,2H3;1-3H3;/rC16H23AuP/c1-13-8-7-9-16(12-13)14(2)10-11-15(3)17-18(4,5)6/h3,7-9,12H,2,10-11H2,1,4-6H3
41 atoms
Au -0.017519 -1.586537 0.226808
C  1.235731 0.749987 0.790513
C  0.069051 0.350751 1.059947
C  0.463246 2.984673 1.622939
C  1.772656 2.670931 1.780339
H  2.103353 2.135114 2.662754
C  -1.064527 1.03268 1.729535
H  -1.581172 0.373257 2.427462
H  -1.784161 1.323263 0.959414
C  -0.536137 2.293742 2.482046
P  -0.245352 -3.696709 -0.635718
C  0.271447 -3.830179 -2.363773
C  0.715635 -4.946962 0.249776
H  2.192579 0.680957 0.306546
C  -1.952506 -4.292366 -0.600283
H  -2.58492 -3.619182 -1.181771
H  -2.00426 -5.298368 -1.023116
H  -2.310122 -4.31127 0.430749
H  -0.323264 -3.148768 -2.974712
H  0.130296 -4.854609 -2.716246
H  1.324342 -3.556149 -2.450855
H  1.775434 -4.689764 0.205544
H  0.558551 -5.9280 -0.204742
H  0.401493 -4.974272 1.294684
H  2.538919 3.105185 1.148095
H  -1.393776 2.924616 2.714206
H  -0.068749 1.973514 3.413486
C  -0.01305 3.833943 0.502829
C  -1.129619 4.653725 0.660606
C  0.65408 3.82772 -0.727469
C  -1.55207 5.461943 -0.389362
H  -1.659445 4.686004 1.605123
C  0.23298 4.620841 -1.787123
H  1.507126 3.172867 -0.869665
C  -0.880415 5.444606 -1.602036
H  -2.413651 6.10752 -0.256437
H  -1.222179 6.07244 -2.419452
C  0.952455 4.595494 -3.110835
H  0.270794 4.316718 -3.919008
H  1.357119 5.582715 -3.350727
H  1.778271 3.881811 -3.096984
totalener: -1101.02195641814501 hartree
nucrepener: 1524.03203749763065 hartree
electener: -2624.97557859199924 hartree
oneelecener: -4562.27571196065674 hartree
twoeener: 1937.30013336865750 hartree
cpcmener: -0.07158764429254 hartree
kineticenergy: 1007.28096446514508 hartree
exchangeener: -84.619203203342 hartree
dispersion: -0.110028404 hartree
dispersion: -0.110021457 hartree
dispersion: -0.110033851 hartree
dispersion: -0.110012600 hartree
dispersion: -0.110015636 hartree
dispersion: -0.110017031 hartree
dispersion: -0.110017083 hartree
dispersion: -0.110016257 hartree
dispersion: -0.110016727 hartree
dispersion: -0.110016196 hartree
dispersion: -0.110017225 hartree
dispersion: -0.110016369 hartree
elementType: Au C H P
energy: -2098.6456 -281.4930 -281.0394 -280.5496 -280.5067 -280.3130 -280.1748 -280.1369 -280.0845 -279.8961 -279.8543 -279.8520 -279.8510 -279.8494 -279.8487 -279.7824 -279.4367 -182.4205 -132.1560 -132.1559 -132.1237 -116.8469 -67.6128 -67.1275 -67.1039 -27.9711 -27.1621 -25.7051 -25.4225 -24.9213 -24.3607 -23.9522 -23.0161 -23.0146 -22.4955 -21.5246 -20.7042 -19.7732 -19.0223 -18.7992 -18.1326 -17.3779 -16.4813 -16.4348 -16.2612 -15.8424 -15.4680 -15.4029 -15.3282 -15.3091 -15.2508 -14.7414 -14.4628 -14.4436 -14.3988 -14.3744 -13.9409 -13.8054 -13.5466 -13.3529 -13.2879 -13.1797 -12.9348 -12.8425 -12.3222 -12.2810 -12.2218 -12.0239 -11.7553 -11.7335 -11.5456 -10.7351 -10.4305 -10.2299 -9.6370 -9.0884 -0.3750 0.8338 1.1122 1.5515 1.7186 2.1674 2.3602 2.7651 3.0404 3.4072 3.5439 electronvolt
chargesum: 1.0000000
charge: 0.125899 -0.184755 -0.046769 0.196115 -0.327949 0.166038 -0.198773 0.163496 0.158905 -0.264561 0.661584 -0.587679 -0.584574 0.226846 -0.591953 0.178803 0.169306 0.178646 0.178622 0.168973 0.177918 0.177977 0.168853 0.178603 0.170700 0.159900 0.143185 0.333710 -0.317780 -0.429258 -0.107413 0.133283 0.333197 0.138798 -0.257599 0.125867 0.126192 -0.468582 0.143110 0.144296 0.138826
charge: 0.276281 0.015593 -0.313586 -0.089989 -0.110558 0.140418 -0.184534 0.148362 0.155208 -0.155612 0.640950 -0.432367 -0.432448 0.160194 -0.432006 0.126535 0.121693 0.126548 0.126429 0.121629 0.126256 0.126267 0.121596 0.126424 0.133304 0.146748 0.145480 -0.104681 -0.098203 -0.071777 -0.129034 0.146601 -0.153102 0.149082 -0.101741 0.143493 0.145406 -0.230291 0.124173 0.124857 0.120403
qa: 0.1259 -0.1848 -0.0468 0.1961 -0.3279 0.1660 -0.1988 0.1635 0.1589 -0.2646 0.6616 -0.5877 -0.5846 0.2268 -0.5920 0.1788 0.1693 0.1786 0.1786 0.1690 0.1779 0.1780 0.1689 0.1786 0.1707 0.1599 0.1432 0.3337 -0.3178 -0.4293 -0.1074 0.1333 0.3332 0.1388 -0.2576 0.1259 0.1262 -0.4686 0.1431 0.1443 0.1388
va: 1.6446 3.8354 3.7359 3.7393 3.8911 0.9659 3.9568 0.9495 0.9569 3.9729 4.1291 3.8432 3.8422 0.9470 3.8421 0.9538 0.9573 0.9538 0.9539 0.9573 0.9543 0.9541 0.9573 0.9536 0.9610 0.9604 0.9629 3.6836 3.9961 3.9831 3.8511 0.9664 3.7537 0.9719 3.9411 0.9668 0.9636 3.8612 0.9556 0.9553 0.9662
dispersion: -0.110016617 hartree
energy: -1101.132223642247 hartree
dipole: -4.778114438 5.072513503 0.294399065 227.297761309 -228.970075411 -1.672314102 -34.117963766 34.078868783 -0.039094983
dipolemethod: SCF
magnitude: 1.698479815 au
magnitude: 4.317192597 debye
temp: 298.15 k
press: 1.00 atm
zeropoint: 0.34608445 hartree
thermalvibcorrection: 0.01897509 hartree
thermalrotcorrection: 0.00141627 hartree
thermaltrasncorrection: 0.00141627 hartree
thermaltotal: -1100.76433156 hartree
thermalcorr: 0.02180764 hartree
nonthermalcorr: 0.34608445 hartree
totalcorr: 0.36789208 hartree
thermalcorrenthalpy: 0.00094421 hartree
totalenthalpy: -1100.76338735 hartree
vibrat: 0.03474928 hartree
rotat: 0.01665284 hartree
transl: 0.02098018 hartree
total: 0.07238230 hartree
totalentropycorr: -0.07238230 hartree
gibbsenthalpy: -1100.83576965 hartree
gibbsminuselec: 0.29645399 hartree
