program: Orca
programVersion: 6.1.x
elementType: Au C C C C H C H H C P C C H C H H H H H H H H H H H H C C C C H C H C H H N O O
elementType: Au
keywords: optts freq wb97x-d3bj def2-tzvp(-f) def2/J tightopt verytightscf
charge: 1
multiplicity: 1
frequency: 0.00 0.00 0.00 0.00 0.00 0.00 -372.80 9.18 13.51 23.61 34.54 36.16 48.76 73.29 111.48 118.35 130.90 165.92 174.89 184.80 185.79 188.37 213.07 222.44 224.79 243.44 255.95 257.28 287.11 300.78 347.83 370.98 391.32 420.92 451.23 463.73 508.05 547.83 605.98 629.48 647.43 680.97 694.53 706.50 731.46 772.94 777.80 779.11 793.28 808.94 835.93 860.55 873.65 874.25 879.98 886.81 897.42 901.62 914.63 973.89 974.40 979.87 996.10 1006.57 1013.42 1017.74 1022.43 1042.93 1064.27 1130.75 1149.32 1149.75 1195.03 1210.60 1224.95 1306.84 1313.95 1334.70 1336.63 1337.27 1349.60 1353.52 1388.89 1439.61 1443.85 1446.15 1447.05 1447.23 1454.25 1454.49 1459.35 1460.98 1463.46 1506.87 1557.51 1612.32 1647.55 1685.31 1690.42 1817.22 3074.05 3074.60 3074.71 3098.23 3118.74 3154.42 3164.80 3165.07 3165.93 3172.11 3172.27 3172.83 3175.30 3178.89 3233.75 3238.13 3259.71 3261.00 3268.84 3359.13
frequency: 9.18 13.51 23.61 34.54 36.16 48.76 73.29 111.48 118.35 130.90 165.92 174.89 184.80 185.79 188.37 213.07 222.44 224.79 243.44 255.95 257.28 287.11 300.78 347.83 370.98 391.32 420.92 451.23 463.73 508.05 547.83 605.98 629.48 647.43 680.97 694.53 706.50 731.46 772.94 777.80 779.11 793.28 808.94 835.93 860.55 873.65 874.25 879.98 886.81 897.42 901.62 914.63 973.89 974.40 979.87 996.10 1006.57 1013.42 1017.74 1022.43 1042.93 1064.27 1130.75 1149.32 1149.75 1195.03 1210.60 1224.95 1306.84 1313.95 1334.70 1336.63 1337.27 1349.60 1353.52 1388.89 1439.61 1443.85 1446.15 1447.05 1447.23 1454.25 1454.49 1459.35 1460.98 1463.46 1506.87 1557.51 1612.32 1647.55 1685.31 1690.42 1817.22 3074.05 3074.60 3074.71 3098.23 3118.74 3154.42 3164.80 3165.07 3165.93 3172.11 3172.27 3172.83 3175.30 3178.89 3233.75 3238.13 3259.71 3261.00 3268.84 3359.13
formula: C15H20AuNO2P
InChI: InChI=1/C12H11NO2.C3H9P.Au/c1-3-4-5-10(2)11-6-8-12(9-7-11)13(14)15;1-4(2)3;/h1,6-9H,2,4-5H2;1-3H3;/rC15H20AuNO2P/c1-12(6-7-13(2)16-20(3,4)5)14-8-10-15(11-9-14)17(18)19/h2,8-11H,1,6-7H2,3-5H3
40 atoms
Au 0.013251 -2.119376 0.127621
C  1.196676 0.074351 1.270369
C  -0.010879 -0.296109 1.183082
C  0.333923 2.202822 2.186728
C  1.548585 1.760954 2.600874
H  1.623936 1.104252 3.459823
C  -1.249785 0.375335 1.644867
H  -1.948823 -0.324872 2.102878
H  -1.744686 0.806579 0.770488
C  -0.881886 1.497696 2.667826
P  -0.094759 -4.111446 -1.000257
C  1.109086 -4.256388 -2.342198
C  0.194448 -5.550188 0.057086
H  2.235932 -0.007868 1.007212
C  -1.706042 -4.398842 -1.769764
H  -1.915616 -3.600646 -2.484105
H  -1.706193 -5.36101 -2.287267
H  -2.481138 -4.398221 -1.001183
H  0.946205 -3.456225 -3.066386
H  0.999072 -5.224505 -2.836623
H  2.118475 -4.166835 -1.936772
H  1.187909 -5.479414 0.50359
H  0.123997 -6.466745 -0.533329
H  -0.550902 -5.571455 0.854286
H  2.466508 2.210003 2.238218
H  -1.742451 2.160035 2.757231
H  -0.684398 1.035568 3.63495
C  0.200253 3.235767 1.128304
C  -0.856322 4.147869 1.170766
C  1.126303 3.312463 0.083667
C  -0.98524 5.127138 0.198535
H  -1.576706 4.114783 1.978262
C  1.003937 4.277662 -0.900552
H  1.939804 2.599964 0.023451
C  -0.052905 5.170599 -0.823196
H  -1.795896 5.842069 0.232371
H  1.711417 4.333964 -1.716493
N  -0.192935 6.198732 -1.870275
O  -1.119014 6.982537 -1.779048
O  0.624612 6.209329 -2.771451
totalener: -1266.27697185036686 hartree
nucrepener: 1732.35239056346472 hartree
electener: -2998.53984758582419 hartree
oneelecener: -5202.97843774508328 hartree
twoeener: 2204.43859015925909 hartree
cpcmener: -0.08408599414621 hartree
kineticenergy: 1171.71251868573199 hartree
exchangeener: -96.646694159272 hartree
dispersion: -0.109616419 hartree
temp: 298.15 k
press: 1.00 atm
thermalcorrenthalpy: 0.00094421 hartree
totalenthalpy: -1266.04435923 hartree
vibrat: 0.03087460 hartree
rotat: 0.01709003 hartree
transl: 0.02107582 hartree
total: 0.06904045 hartree
totalentropycorr: -0.06904045 hartree
gibbsenthalpy: -1266.11339968 hartree
gibbsminuselec: 0.27318859 hartree
dispersion: -0.110603356 hartree
dispersion: -0.110692821 hartree
dispersion: -0.110690183 hartree
dispersion: -0.110701822 hartree
dispersion: -0.110707712 hartree
dispersion: -0.110710218 hartree
dispersion: -0.110712180 hartree
dispersion: -0.110714001 hartree
dispersion: -0.110715377 hartree
dispersion: -0.110716548 hartree
elementType: Au C H P N O
energy: -2098.6526 -524.2184 -524.2176 -399.2940 -281.6315 -281.5562 -281.3411 -280.9042 -280.5898 -280.5776 -280.5665 -280.5656 -280.4596 -280.4396 -280.4360 -280.2254 -279.8629 -279.8595 -279.8592 -182.4278 -132.1636 -132.1632 -132.1304 -116.8530 -67.6179 -67.1308 -67.1120 -37.9275 -32.9825 -28.5987 -27.6432 -26.2653 -25.4398 -25.2008 -25.0326 -24.3629 -23.0256 -23.0236 -23.0003 -21.7337 -20.8256 -20.3598 -19.2879 -19.1342 -18.8655 -18.5139 -18.4984 -17.8436 -17.1542 -16.6849 -16.4402 -16.1425 -15.9088 -15.7253 -15.5491 -15.3592 -15.3178 -15.3058 -15.0403 -14.4818 -14.4490 -14.4072 -14.1712 -13.9506 -13.7085 -13.5046 -13.1219 -12.9608 -12.8532 -12.8065 -12.2944 -12.1761 -12.0105 -11.9440 -11.7672 -11.7383 -11.6551 -11.5762 -10.9139 -10.6766 -10.3643 -10.2420 -9.5196 -1.0316 -0.0487 0.9080 1.0400 1.2168 1.7345 2.2066 2.3339 2.7522 3.0267 3.4549 electronvolt
chargesum: 1.0000000
charge: 0.120666 -0.180265 -0.061682 0.214680 -0.312444 0.172004 -0.196059 0.164896 0.159774 -0.267417 0.660853 -0.589344 -0.583595 0.225578 -0.591241 0.178937 0.169392 0.178415 0.178615 0.169289 0.177781 0.177977 0.168862 0.178328 0.178728 0.162594 0.147286 0.349991 -0.297859 -0.249898 -0.176877 0.143739 -0.205042 0.149568 0.243942 0.149759 0.147722 0.509513 -0.383294 -0.383867
charge: 0.273575 0.011204 -0.317979 -0.080806 -0.094482 0.145178 -0.183095 0.149025 0.155665 -0.152256 0.640659 -0.432315 -0.432560 0.161197 -0.432321 0.126528 0.121646 0.126489 0.126384 0.121769 0.126222 0.126232 0.121572 0.126325 0.137698 0.148626 0.147890 -0.077116 -0.067690 -0.067566 -0.069275 0.154810 -0.070001 0.155251 -0.120035 0.156545 0.156349 0.025336 -0.072043 -0.072637
qa: 0.1207 -0.1803 -0.0617 0.2147 -0.3124 0.1720 -0.1961 0.1649 0.1598 -0.2674 0.6609 -0.5893 -0.5836 0.2256 -0.5912 0.1789 0.1694 0.1784 0.1786 0.1693 0.1778 0.1780 0.1689 0.1783 0.1787 0.1626 0.1473 0.3500 -0.2979 -0.2499 -0.1769 0.1437 -0.2050 0.1496 0.2439 0.1498 0.1477 0.5095 -0.3833 -0.3839
va: 1.6432 3.8353 3.7471 3.7569 3.8914 0.9649 3.9642 0.9493 0.9565 3.9795 4.1264 3.8435 3.8423 0.9461 3.8414 0.9536 0.9572 0.9538 0.9540 0.9573 0.9544 0.9540 0.9573 0.9535 0.9570 0.9606 0.9624 3.7124 3.9627 3.9254 3.9243 0.9673 3.9611 0.9681 3.8246 0.9933 0.9948 4.2996 1.9387 1.9383
dispersion: -0.110717755 hartree
energy: -1266.388494182123 hartree
dipole: -2.679904489 3.168588610 0.488684122 284.707913002 -288.998211153 -4.290298151 -15.067120265 17.070891026 2.003770761
dipolemethod: SCF
magnitude: 4.760311719 au
magnitude: 12.099750806 debye
zeropoint: 0.32133356 hartree
thermalvibcorrection: 0.01971639 hartree
thermalrotcorrection: 0.00141627 hartree
thermaltrasncorrection: 0.00141627 hartree
thermaltotal: -1266.04461169 hartree
thermalcorr: 0.02254893 hartree
nonthermalcorr: 0.32133356 hartree
totalcorr: 0.34388250 hartree
totalenthalpy: -1266.04366748 hartree
vibrat: 0.03658447 hartree
rotat: 0.01707231 hartree
total: 0.07473260 hartree
