program: Orca
programVersion: 6.1.x
elementType: Au C C C C H C H H C P C C H C H H H H H H H H H H H H C C C C H C H C F F F
elementType: Au
keywords: optts freq wb97x-d3bj def2-tzvp(-f) def2/J tightopt verytightscf
charge: 1
multiplicity: 1
frequency: 0.00 0.00 0.00 0.00 0.00 0.00 -376.72 13.16 17.04 25.04 37.32 40.40 88.94 120.30 122.80 134.93 164.12 177.23 181.05 185.77 191.38 194.37 217.48 223.23 224.10 256.37 257.54 262.40 282.48 298.07 306.20 346.00 372.24 374.40 390.93 428.10 490.31 541.19 574.40 582.11 592.76 638.40 654.22 692.62 706.82 727.75 734.65 778.76 779.01 790.17 808.73 828.87 864.94 874.33 875.31 881.03 899.50 905.43 909.42 961.68 973.68 974.87 980.54 1001.84 1011.86 1023.17 1059.95 1066.79 1123.15 1177.77 1208.86 1247.91 1260.48 1299.82 1309.06 1320.56 1336.74 1338.18 1350.19 1357.77 1407.90 1443.71 1447.06 1447.34 1451.73 1454.10 1454.40 1460.98 1463.86 1486.27 1509.15 1584.14 1648.54 1685.16 1706.99 1819.57 3074.21 3074.80 3075.17 3098.46 3119.52 3153.92 3165.26 3165.34 3166.06 3171.98 3172.05 3172.53 3176.39 3178.96 3246.29 3248.74 3270.29 3358.84
frequency: 13.16 17.04 25.04 37.32 40.40 88.94 120.30 122.80 134.93 164.12 177.23 181.05 185.77 191.38 194.37 217.48 223.23 224.10 256.37 257.54 262.40 282.48 298.07 306.20 346.00 372.24 374.40 390.93 428.10 490.31 541.19 574.40 582.11 592.76 638.40 654.22 692.62 706.82 727.75 734.65 778.76 779.01 790.17 808.73 828.87 864.94 874.33 875.31 881.03 899.50 905.43 909.42 961.68 973.68 974.87 980.54 1001.84 1011.86 1023.17 1059.95 1066.79 1123.15 1177.77 1208.86 1247.91 1260.48 1299.82 1309.06 1320.56 1336.74 1338.18 1350.19 1357.77 1407.90 1443.71 1447.06 1447.34 1451.73 1454.10 1454.40 1460.98 1463.86 1486.27 1509.15 1584.14 1648.54 1685.16 1706.99 1819.57 3074.21 3074.80 3075.17 3098.46 3119.52 3153.92 3165.26 3165.34 3166.06 3171.98 3172.05 3172.53 3176.39 3178.96 3246.29 3248.74 3270.29 3358.84
formula: C15H18F3AuP
InChI: InChI=1/C12H9F3.C3H9P.Au/c1-3-4-5-8(2)9-6-10(13)12(15)11(14)7-9;1-4(2)3;/h1,6-7H,2,4-5H2;1-3H3;/rC15H18AuF3P/c1-10(6-7-11(2)16-20(3,4)5)12-8-13(17)15(19)14(18)9-12/h2,8-9H,1,6-7H2,3-5H3
38 atoms
Au -0.052078 -2.038423 0.210552
C  1.281483 0.190136 1.066579
C  0.072543 -0.168353 1.174934
C  0.560799 2.389193 1.933762
C  1.820089 1.970644 2.216832
H  2.007168 1.379288 3.105408
C  -1.086968 0.545845 1.762311
H  -1.710631 -0.114194 2.365755
H  -1.704348 0.918073 0.940277
C  -0.574274 1.734822 2.635853
P  -0.311621 -4.068652 -0.820576
C  0.625139 -4.21839 -2.360397
C  0.21163 -5.468915 0.19742
H  2.274538 0.081694 0.668965
C  -2.027944 -4.419727 -1.269728
H  -2.392256 -3.645622 -1.947448
H  -2.092452 -5.393858 -1.760077
H  -2.646463 -4.422458 -0.370425
H  0.302201 -3.444217 -3.058782
H  0.457987 -5.202903 -2.803717
H  1.688793 -4.087189 -2.153711
H  1.268899 -5.362687 0.446885
H  0.057235 -6.403366 -0.347225
H  -0.369881 -5.484491 1.120945
H  2.683373 2.376116 1.701497
H  -1.411655 2.410862 2.805385
H  -0.236862 1.343045 3.595162
C  0.280129 3.322789 0.813578
C  -0.823172 4.174571 0.872172
C  1.117832 3.355877 -0.304056
C  -1.061594 5.050747 -0.167296
H  -1.493401 4.192205 1.721678
C  0.846539 4.233642 -1.330124
H  1.967687 2.692518 -0.4026
C  -0.239124 5.094166 -1.279206
F  -2.111046 5.887356 -0.119732
F  -0.487722 5.940169 -2.283282
F  1.631311 4.267603 -2.419438
totalener: -1359.49838545240073 hartree
nucrepener: 1788.49591163498894 hartree
electener: -3147.91193878906188 hartree
oneelecener: -5451.42577862633425 hartree
twoeener: 2303.51383983727237 hartree
cpcmener: -0.07892497326254 hartree
kineticenergy: 1264.75875922510340 hartree
exchangeener: -101.663789729907 hartree
dispersion: -0.104649449 hartree
temp: 298.15 k
press: 1.00 atm
thermalcorrenthalpy: 0.00094421 hartree
totalenthalpy: -1359.28724244 hartree
vibrat: 0.03304768 hartree
rotat: 0.01705978 hartree
transl: 0.02110237 hartree
total: 0.07120982 hartree
totalentropycorr: -0.07120982 hartree
gibbsenthalpy: -1359.35845227 hartree
gibbsminuselec: 0.24458263 hartree
dispersion: -0.105716917 hartree
dispersion: -0.105744929 hartree
dispersion: -0.105770644 hartree
dispersion: -0.105763748 hartree
dispersion: -0.105775891 hartree
dispersion: -0.105770700 hartree
dispersion: -0.105780384 hartree
dispersion: -0.105775673 hartree
dispersion: -0.105783538 hartree
dispersion: -0.105779142 hartree
dispersion: -0.105785633 hartree
elementType: Au C H P F
energy: -2098.6487 -675.1011 -674.9341 -674.9229 -282.8439 -282.8241 -282.8148 -281.5524 -281.3565 -280.9936 -280.5882 -280.5718 -280.5203 -280.5084 -280.4259 -280.2224 -279.8585 -279.8561 -279.8546 -182.4240 -132.1596 -132.1594 -132.1269 -116.8504 -67.6152 -67.1287 -67.1091 -38.1897 -37.8049 -37.6077 -28.6143 -27.5287 -25.9153 -25.4305 -25.1137 -24.6516 -24.3305 -23.0223 -23.0200 -21.9258 -21.6810 -21.3829 -19.8774 -19.2783 -18.8997 -18.8078 -18.7041 -17.8997 -17.5760 -17.4813 -17.0927 -16.5985 -16.4622 -16.1731 -16.1552 -15.9896 -15.6379 -15.5685 -15.5098 -15.3180 -15.3082 -14.9701 -14.5704 -14.4532 -14.4417 -14.2095 -13.9473 -13.8647 -13.6977 -13.5509 -13.2868 -13.0207 -12.8879 -12.8483 -12.2673 -12.1246 -11.7636 -11.7363 -11.6239 -10.7890 -10.5676 -10.2385 -10.1046 -9.3455 -0.5762 0.7420 1.0559 1.2825 1.6345 2.0984 2.3184 2.6529 2.7529 3.0563 3.4897 electronvolt
chargesum: 1.0000000
charge: 0.121645 -0.178996 -0.058590 0.226620 -0.314171 0.172185 -0.203620 0.164920 0.161002 -0.265730 0.661618 -0.588588 -0.584067 0.225875 -0.591344 0.178758 0.169248 0.178490 0.178492 0.169124 0.177744 0.177871 0.168824 0.178461 0.177024 0.165315 0.148108 0.305795 -0.368753 -0.322655 0.300577 0.146174 0.289337 0.152774 0.207971 -0.245269 -0.236461 -0.245710
charge: 0.274118 0.012756 -0.317077 -0.083147 -0.096612 0.144538 -0.183477 0.149000 0.155571 -0.152582 0.640814 -0.432387 -0.432556 0.161204 -0.432174 0.126469 0.121687 0.126477 0.126445 0.121676 0.126194 0.126218 0.121599 0.126381 0.136920 0.148283 0.147910 -0.088309 -0.054586 -0.054244 -0.143780 0.162007 -0.143400 0.162646 -0.127927 0.103264 0.117038 0.103041
qa: 0.1216 -0.1790 -0.0586 0.2266 -0.3142 0.1722 -0.2036 0.1649 0.1610 -0.2657 0.6616 -0.5886 -0.5841 0.2259 -0.5913 0.1788 0.1692 0.1785 0.1785 0.1691 0.1777 0.1779 0.1688 0.1785 0.1770 0.1653 0.1481 0.3058 -0.3688 -0.3227 0.3006 0.1462 0.2893 0.1528 0.2080 -0.2453 -0.2365 -0.2457
va: 1.6430 3.8336 3.7441 3.7423 3.8822 0.9647 3.9655 0.9495 0.9549 3.9683 4.1260 3.8438 3.8423 0.9460 3.8417 0.9538 0.9573 0.9538 0.9540 0.9573 0.9544 0.9540 0.9573 0.9537 0.9582 0.9572 0.9621 3.6213 3.9055 3.8539 3.8802 0.9770 3.9156 0.9786 3.9304 1.0661 1.0838 1.0651
dispersion: -0.105781492 hartree
energy: -1359.605088109560 hartree
dipole: -0.093256867 0.673040553 0.579783685 257.789595307 -261.431035874 -3.641440567 -20.618656294 22.132590735 1.513934441
dipolemethod: SCF
magnitude: 3.986005019 au
magnitude: 10.131619586 debye
zeropoint: 0.29390349 hartree
thermalvibcorrection: 0.01968521 hartree
thermalrotcorrection: 0.00141627 hartree
thermaltrasncorrection: 0.00141627 hartree
thermaltotal: -1359.28866686 hartree
thermalcorr: 0.02251775 hartree
nonthermalcorr: 0.29390349 hartree
totalcorr: 0.31642125 hartree
totalenthalpy: -1359.28772265 hartree
vibrat: 0.03593050 hartree
rotat: 0.01703895 hartree
total: 0.07407182 hartree
