program: Orca
programVersion: 6.1.x
elementType: Au C C C C H C H H C P C C H C H H H H H H H H H H H H C C C C H C H C N O O C N C N
elementType: Au
keywords: optts freq wb97x-d3bj def2-tzvp(-f) def2/J tightopt verytightscf
charge: 1
multiplicity: 1
frequency: 0.00 0.00 0.00 0.00 0.00 0.00 -365.28 7.12 13.35 22.15 35.35 39.47 52.23 61.13 86.34 107.34 119.33 127.61 143.66 150.30 167.75 170.25 174.71 183.04 188.12 188.77 212.02 221.13 221.53 231.77 255.45 257.24 278.08 294.28 332.42 371.47 381.84 395.00 403.04 414.50 443.68 482.28 493.49 542.33 551.67 586.27 626.14 634.04 643.80 675.53 705.01 708.00 725.72 747.13 778.75 779.03 808.06 828.88 844.21 849.94 874.31 874.99 882.38 903.03 912.31 949.93 960.23 973.66 974.08 977.89 981.08 983.10 1005.36 1012.73 1025.52 1083.00 1124.19 1167.88 1210.41 1226.10 1275.26 1284.34 1311.68 1333.14 1336.78 1337.44 1347.03 1349.93 1395.22 1443.57 1445.50 1446.50 1446.92 1453.95 1454.24 1454.80 1460.61 1463.27 1465.40 1510.39 1524.12 1638.19 1646.54 1675.17 1694.49 1794.67 2405.38 2407.06 3073.88 3074.38 3074.81 3098.73 3122.38 3155.43 3164.25 3164.69 3165.66 3171.62 3172.44 3172.61 3175.81 3182.59 3250.86 3251.33 3270.87 3345.52
frequency: 7.12 13.35 22.15 35.35 39.47 52.23 61.13 86.34 107.34 119.33 127.61 143.66 150.30 167.75 170.25 174.71 183.04 188.12 188.77 212.02 221.13 221.53 231.77 255.45 257.24 278.08 294.28 332.42 371.47 381.84 395.00 403.04 414.50 443.68 482.28 493.49 542.33 551.67 586.27 626.14 634.04 643.80 675.53 705.01 708.00 725.72 747.13 778.75 779.03 808.06 828.88 844.21 849.94 874.31 874.99 882.38 903.03 912.31 949.93 960.23 973.66 974.08 977.89 981.08 983.10 1005.36 1012.73 1025.52 1083.00 1124.19 1167.88 1210.41 1226.10 1275.26 1284.34 1311.68 1333.14 1336.78 1337.44 1347.03 1349.93 1395.22 1443.57 1445.50 1446.50 1446.92 1453.95 1454.24 1454.80 1460.61 1463.27 1465.40 1510.39 1524.12 1638.19 1646.54 1675.17 1694.49 1794.67 2405.38 2407.06 3073.88 3074.38 3074.81 3098.73 3122.38 3155.43 3164.25 3164.69 3165.66 3171.62 3172.44 3172.61 3175.81 3182.59 3250.86 3251.33 3270.87 3345.52
formula: C17H18AuN3O2P
InChI: InChI=1/C14H9N3O2.C3H9P.Au/c1-3-4-5-10(2)11-6-12(8-15)14(17(18)19)13(7-11)9-16;1-4(2)3;/h1,6-7H,2,4-5H2;1-3H3;/rC17H18AuN3O2P/c1-12(6-7-13(2)18-24(3,4)5)14-8-15(10-19)17(21(22)23)16(9-14)11-20/h2,8-9H,1,6-7H2,3-5H3
42 atoms
Au -0.067763 -2.61358 0.13774
C  1.218471 -0.488276 1.355941
C  0.004752 -0.861359 1.298619
C  0.449945 1.568641 2.386228
C  1.670395 1.073101 2.721952
H  1.7646 0.393819 3.560948
C  -1.199036 -0.196136 1.853042
H  -1.881178 -0.903986 2.324512
H  -1.736276 0.271996 1.023814
C  -0.765589 0.888781 2.894551
P  -0.257929 -4.522445 -1.118094
C  0.069237 -4.263658 -2.87806
C  0.871161 -5.840922 -0.610038
H  2.23441 -0.579924 1.013051
C  -1.91052 -5.253412 -1.041491
H  -2.64408 -4.533205 -1.40828
H  -1.947852 -6.156743 -1.654853
H  -2.148985 -5.505398 -0.00658
H  -0.631541 -3.526331 -3.273746
H  -0.046127 -5.204892 -3.420735
H  1.086543 -3.890184 -3.008295
H  1.901753 -5.493707 -0.703078
H  0.724023 -6.720413 -1.241368
H  0.678703 -6.103445 0.431751
H  2.583412 1.511437 2.334122
H  -1.602971 1.57214 3.033451
H  -0.543653 0.395987 3.840508
C  0.30728 2.644452 1.371128
C  -0.688839 3.605864 1.507021
C  1.163393 2.708728 0.274902
C  -0.81668 4.635264 0.577363
H  -1.369984 3.585359 2.347819
C  1.022071 3.708708 -0.681761
H  1.941333 1.96947 0.134989
C  0.034092 4.673758 -0.519832
N  -0.11741 5.739056 -1.524416
O  -0.029557 5.414525 -2.689636
O  -0.319083 6.861573 -1.113082
C  -1.868943 5.598988 0.776289
N  -2.736166 6.322055 0.983222
C  1.935934 3.71139 -1.79537
N  2.705232 3.663938 -2.646096
totalener: -1450.84184848333371 hartree
nucrepener: 2185.24719567879765 hartree
electener: -3635.97498019058366 hartree
oneelecener: -6350.18417176941784 hartree
twoeener: 2714.20919157883418 hartree
cpcmener: -0.11277158188117 hartree
kineticenergy: 1355.57444822670027 hartree
exchangeener: -112.490557655983 hartree
dispersion: -0.122071904 hartree
temp: 298.15 k
press: 1.00 atm
thermalcorrenthalpy: 0.00094421 hartree
totalenthalpy: -1450.62082880 hartree
vibrat: 0.03729644 hartree
rotat: 0.01748874 hartree
transl: 0.02121783 hartree
total: 0.07600301 hartree
totalentropycorr: -0.07600301 hartree
gibbsenthalpy: -1450.69683181 hartree
gibbsminuselec: 0.26708858 hartree
dispersion: -0.123099135 hartree
dispersion: -0.123122265 hartree
dispersion: -0.123189460 hartree
dispersion: -0.123200402 hartree
dispersion: -0.123208163 hartree
dispersion: -0.123211654 hartree
dispersion: -0.123214735 hartree
dispersion: -0.123216837 hartree
dispersion: -0.123218456 hartree
dispersion: -0.123219589 hartree
dispersion: -0.123220583 hartree
dispersion: -0.123221134 hartree
dispersion: -0.123221600 hartree
dispersion: -0.123221873 hartree
dispersion: -0.123221997 hartree
dispersion: -0.123221962 hartree
dispersion: -0.123221799 hartree
dispersion: -0.123221567 hartree
dispersion: -0.123220605 hartree
dispersion: -0.123220040 hartree
dispersion: -0.123219277 hartree
dispersion: -0.123218338 hartree
dispersion: -0.123217247 hartree
dispersion: -0.123215887 hartree
dispersion: -0.123214240 hartree
dispersion: -0.123212271 hartree
dispersion: -0.123209384 hartree
dispersion: -0.123206028 hartree
dispersion: -0.123201666 hartree
dispersion: -0.123195855 hartree
dispersion: -0.123187768 hartree
dispersion: -0.123176326 hartree
dispersion: -0.123101472 hartree
dispersion: -0.123050657 hartree
dispersion: -0.123052090 hartree
dispersion: -0.123010391 hartree
dispersion: -0.122918716 hartree
dispersion: -0.122852196 hartree
dispersion: -0.122936851 hartree
dispersion: -0.122957395 hartree
dispersion: -0.122962310 hartree
dispersion: -0.122976085 hartree
dispersion: -0.123006903 hartree
dispersion: -0.122987705 hartree
dispersion: -0.122953569 hartree
dispersion: -0.122975323 hartree
dispersion: -0.122975726 hartree
dispersion: -0.122974666 hartree
dispersion: -0.122973974 hartree
dispersion: -0.122973776 hartree
dispersion: -0.122973526 hartree
dispersion: -0.122973579 hartree
dispersion: -0.122973742 hartree
dispersion: -0.122973972 hartree
dispersion: -0.122974276 hartree
dispersion: -0.122974602 hartree
dispersion: -0.122974783 hartree
dispersion: -0.122974888 hartree
dispersion: -0.122974681 hartree
dispersion: -0.122974490 hartree
dispersion: -0.122974132 hartree
dispersion: -0.122973849 hartree
dispersion: -0.122973539 hartree
dispersion: -0.122973245 hartree
dispersion: -0.122972979 hartree
dispersion: -0.122972663 hartree
dispersion: -0.122972421 hartree
dispersion: -0.122972139 hartree
dispersion: -0.122971918 hartree
dispersion: -0.122971687 hartree
dispersion: -0.122971441 hartree
dispersion: -0.122971216 hartree
dispersion: -0.122971376 hartree
dispersion: -0.122971147 hartree
dispersion: -0.122970963 hartree
dispersion: -0.122970704 hartree
dispersion: -0.122970550 hartree
dispersion: -0.122970339 hartree
elementType: Au C H P N O
energy: -2098.6550 -524.8729 -524.8705 -399.9686 -393.0565 -393.0418 -282.9614 -282.3463 -282.3445 -281.7403 -281.6375 -281.6299 -281.6197 -281.5921 -281.4815 -281.4672 -280.7799 -280.6672 -280.6475 -280.4037 -279.8706 -279.8671 -279.8667 -182.4308 -132.1666 -132.1663 -132.1331 -116.8616 -67.6249 -67.1368 -67.1224 -38.6391 -33.7397 -29.9833 -29.4236 -29.0907 -28.1377 -26.8749 -26.6268 -25.6104 -25.4346 -24.5762 -24.0645 -23.0331 -23.0314 -22.7435 -21.7830 -21.7050 -20.8767 -19.6572 -19.3774 -19.0224 -18.8241 -18.5547 -18.1044 -17.8512 -17.6724 -17.3588 -16.6417 -16.2138 -16.0965 -15.7030 -15.6313 -15.4762 -15.3298 -15.3172 -14.9267 -14.7032 -14.4593 -14.4552 -14.2794 -14.2066 -14.0440 -13.9591 -13.8977 -13.6546 -13.4719 -13.3186 -13.2544 -13.1767 -12.9518 -12.8763 -12.4928 -12.4462 -12.2709 -12.2438 -12.1984 -11.7831 -11.7524 -11.6975 -11.1968 -10.8990 -10.6940 -10.2546 -9.8190 -1.4945 -0.6142 -0.3205 0.5887 0.8989 1.2036 1.7174 2.2201 2.3240 2.5046 2.7464 electronvolt
chargesum: 1.0000000
charge: 0.115885 -0.182524 -0.075787 0.185534 -0.291607 0.177820 -0.195617 0.166957 0.161726 -0.271595 0.660223 -0.584968 -0.587017 0.225225 -0.592012 0.178376 0.169601 0.178427 0.178319 0.168811 0.177790 0.177747 0.169484 0.178214 0.187452 0.168104 0.152739 0.419041 -0.446159 -0.392688 0.550087 0.170689 0.535172 0.175581 -0.046662 0.557538 -0.352693 -0.352172 -0.236657 -0.167996 -0.241616 -0.168771
charge: 0.271441 0.003430 -0.321418 -0.070367 -0.078584 0.150281 -0.181435 0.149927 0.156332 -0.147699 0.640129 -0.432567 -0.432575 0.162805 -0.432383 0.126410 0.121721 0.126364 0.126367 0.121667 0.126237 0.126187 0.121739 0.126270 0.142757 0.151219 0.150801 -0.057043 0.026600 0.026834 -0.087526 0.173343 -0.088062 0.173550 -0.010706 0.025547 -0.023960 -0.022601 -0.069925 -0.000035 -0.070146 -0.000926
qa: 0.1159 -0.1825 -0.0758 0.1855 -0.2916 0.1778 -0.1956 0.1670 0.1617 -0.2716 0.6602 -0.5850 -0.5870 0.2252 -0.5920 0.1784 0.1696 0.1784 0.1783 0.1688 0.1778 0.1777 0.1695 0.1782 0.1875 0.1681 0.1527 0.4190 -0.4462 -0.3927 0.5501 0.1707 0.5352 0.1756 -0.0467 0.5575 -0.3527 -0.3522 -0.2367 -0.1680 -0.2416 -0.1688
va: 1.6424 3.8429 3.7589 3.8037 3.8855 0.9635 3.9696 0.9490 0.9545 3.9890 4.1228 3.8437 3.8416 0.9440 3.8423 0.9539 0.9573 0.9537 0.9539 0.9574 0.9543 0.9543 0.9573 0.9539 0.9533 0.9601 0.9614 3.6831 3.9610 3.9388 3.5865 0.9651 3.6281 0.9653 4.0587 4.2002 1.9580 1.9589 3.9269 3.1460 3.9276 3.1467
dispersion: -0.122970124 hartree
energy: -1450.966764232511 hartree
dipole: 5.618713236 -4.968297249 0.650415987 344.002361398 -350.491213068 -6.488851670 -13.112145901 16.270689418 3.158543517
dipolemethod: SCF
magnitude: 7.246008149 au
magnitude: 18.417889022 debye
zeropoint: 0.31838166 hartree
thermalvibcorrection: 0.02338208 hartree
thermalrotcorrection: 0.00141627 hartree
thermaltrasncorrection: 0.00141627 hartree
thermaltotal: -1450.62216794 hartree
thermalcorr: 0.02621463 hartree
nonthermalcorr: 0.31838166 hartree
totalcorr: 0.34459629 hartree
totalenthalpy: -1450.62122373 hartree
vibrat: 0.04344960 hartree
rotat: 0.01745298 hartree
total: 0.08212041 hartree
