program: Orca
programVersion: 6.1.x
elementType: Au C C C C H C H H C P C C H C H H H H H H H H H H H H C C C C H C H C H H C F F F
elementType: Au
keywords: optts freq wb97x-d3bj def2-tzvp(-f) def2/J tightopt verytightscf
charge: 1
multiplicity: 1
frequency: 0.00 0.00 0.00 0.00 0.00 0.00 -376.96 11.04 17.52 17.74 24.44 36.77 40.85 97.55 111.95 122.22 127.93 149.19 168.92 177.85 183.81 184.47 193.83 218.39 222.33 222.82 250.86 256.36 257.69 313.20 324.80 336.84 367.97 371.43 390.41 410.99 447.83 487.27 523.92 545.13 584.38 617.31 634.17 668.23 689.82 706.74 716.78 727.55 739.52 778.38 778.67 808.19 820.75 832.57 847.57 873.54 874.38 885.05 897.68 911.59 950.88 973.49 974.02 974.12 979.73 998.76 1006.43 1022.59 1028.94 1031.79 1058.06 1101.70 1114.22 1133.56 1146.93 1162.67 1193.00 1208.51 1218.09 1299.43 1310.53 1323.48 1336.19 1336.63 1349.00 1354.77 1366.25 1387.96 1443.65 1446.53 1446.60 1446.90 1454.04 1454.18 1460.40 1463.50 1494.14 1510.67 1549.01 1646.66 1679.48 1696.72 1824.06 3074.02 3074.57 3074.90 3098.54 3116.76 3153.70 3164.81 3165.08 3165.88 3172.02 3172.21 3172.41 3174.07 3176.54 3220.83 3229.68 3236.92 3245.20 3267.65 3363.97
frequency: 11.04 17.52 17.74 24.44 36.77 40.85 97.55 111.95 122.22 127.93 149.19 168.92 177.85 183.81 184.47 193.83 218.39 222.33 222.82 250.86 256.36 257.69 313.20 324.80 336.84 367.97 371.43 390.41 410.99 447.83 487.27 523.92 545.13 584.38 617.31 634.17 668.23 689.82 706.74 716.78 727.55 739.52 778.38 778.67 808.19 820.75 832.57 847.57 873.54 874.38 885.05 897.68 911.59 950.88 973.49 974.02 974.12 979.73 998.76 1006.43 1022.59 1028.94 1031.79 1058.06 1101.70 1114.22 1133.56 1146.93 1162.67 1193.00 1208.51 1218.09 1299.43 1310.53 1323.48 1336.19 1336.63 1349.00 1354.77 1366.25 1387.96 1443.65 1446.53 1446.60 1446.90 1454.04 1454.18 1460.40 1463.50 1494.14 1510.67 1549.01 1646.66 1679.48 1696.72 1824.06 3074.02 3074.57 3074.90 3098.54 3116.76 3153.70 3164.81 3165.08 3165.88 3172.02 3172.21 3172.41 3174.07 3176.54 3220.83 3229.68 3236.92 3245.20 3267.65 3363.97
formula: C16H20F3AuP
InChI: InChI=1/C13H11F3.C3H9P.Au/c1-3-4-6-10(2)11-7-5-8-12(9-11)13(14,15)16;1-4(2)3;/h1,5,7-9H,2,4,6H2;1-3H3;/rC16H20AuF3P/c1-12(9-10-13(2)17-21(3,4)5)14-7-6-8-15(11-14)16(18,19)20/h2,6-8,11H,1,9-10H2,3-5H3
41 atoms
Au 0.000277 -2.1182 0.234812
C  1.295273 0.169062 0.963027
C  0.208201 -0.344604 1.355725
C  0.647951 2.169611 2.285066
C  1.968425 1.894246 2.140154
H  2.469334 1.243846 2.847787
C  -0.794307 0.155257 2.327344
H  -1.156737 -0.636153 2.983946
H  -1.652043 0.530603 1.762664
C  -0.162676 1.301917 3.179364
P  -0.334004 -4.066876 -0.9232
C  -0.044351 -3.909011 -2.701585
C  0.739157 -5.418313 -0.381915
H  2.141017 0.22535 0.30172
C  -2.019399 -4.703982 -0.768367
H  -2.72458 -3.963767 -1.150635
H  -2.119889 -5.631559 -1.336701
H  -2.241376 -4.894534 0.283172
H  -0.718851 -3.156904 -3.114718
H  -0.221078 -4.868257 -3.193929
H  0.986062 -3.593889 -2.875611
H  1.783158 -5.130247 -0.517835
H  0.529356 -6.317512 -0.965979
H  0.562999 -5.620944 0.676016
H  2.594151 2.462992 1.461328
H  -0.975215 1.841776 3.665024
H  0.475206 0.857823 3.943528
C  -0.041024 3.169545 1.430801
C  -1.115889 3.912507 1.927228
C  0.3725 3.3853 0.117986
C  -1.749514 4.858326 1.134963
H  -1.449275 3.770066 2.947997
C  -0.275822 4.324317 -0.672823
H  1.187793 2.806387 -0.29991
C  -1.336158 5.068617 -0.174346
H  -2.573383 5.435177 1.53889
H  -1.836444 5.800013 -0.796517
C  0.197268 4.499476 -2.090696
F  0.079694 3.355683 -2.804554
F  1.503638 4.845125 -2.147367
F  -0.485901 5.44641 -2.757014
totalener: -1398.88530708426811 hartree
nucrepener: 1946.84455415285333 hartree
electener: -3345.64824339314873 hartree
oneelecener: -5819.96354049570982 hartree
twoeener: 2474.31529710256109 hartree
cpcmener: -0.07684850716429 hartree
kineticenergy: 1303.91685564382033 hartree
exchangeener: -105.533030273586 hartree
dispersion: -0.110485237 hartree
temp: 298.15 k
press: 1.00 atm
thermalcorrenthalpy: 0.00094421 hartree
totalenthalpy: -1398.65059057 hartree
vibrat: 0.03282949 hartree
rotat: 0.01718340 hartree
transl: 0.02114289 hartree
total: 0.07115578 hartree
totalentropycorr: -0.07115578 hartree
gibbsenthalpy: -1398.72174635 hartree
gibbsminuselec: 0.27404597 hartree
dispersion: -0.111461089 hartree
dispersion: -0.111647338 hartree
dispersion: -0.111580214 hartree
dispersion: -0.111597552 hartree
dispersion: -0.111554537 hartree
dispersion: -0.111570556 hartree
dispersion: -0.111575891 hartree
dispersion: -0.111624936 hartree
dispersion: -0.111659170 hartree
dispersion: -0.111633809 hartree
dispersion: -0.111638049 hartree
elementType: Au C H P F
energy: -2098.6408 -675.0985 -674.9900 -674.9896 -286.8308 -281.5241 -281.2426 -280.7411 -280.6715 -280.5644 -280.5473 -280.4699 -280.3812 -280.3445 -280.3196 -280.1774 -280.1757 -279.8492 -279.8492 -279.8488 -182.4160 -132.1516 -132.1515 -132.1186 -116.8409 -67.6060 -67.1198 -67.0990 -39.7515 -37.3193 -37.1960 -28.3755 -27.4442 -25.9353 -25.4280 -25.3638 -24.5391 -24.2364 -23.0832 -23.0143 -23.0130 -21.6896 -21.1780 -20.8612 -19.8554 -19.7342 -19.4653 -19.0081 -18.7974 -17.8656 -17.4734 -16.7818 -16.6052 -16.3837 -16.3524 -16.2496 -15.8816 -15.6233 -15.5180 -15.4255 -15.3108 -15.3063 -15.2893 -15.0283 -14.6814 -14.6586 -14.4655 -14.4368 -14.4285 -14.0872 -13.9397 -13.8306 -13.5155 -13.3800 -12.9715 -12.8886 -12.7830 -12.6655 -12.2729 -12.1210 -11.7542 -11.7275 -11.6117 -10.8277 -10.6267 -10.2618 -10.2285 -9.3818 -0.5035 0.7453 0.8811 1.0785 1.6324 2.0673 2.3327 2.7306 3.0385 3.4753 3.5217 electronvolt
chargesum: 1.0000000
charge: 0.121969 -0.181485 -0.057362 0.207074 -0.320542 0.170354 -0.195021 0.164316 0.159330 -0.269887 0.661231 -0.587908 -0.584178 0.226130 -0.591571 0.178648 0.169289 0.178363 0.178584 0.168834 0.177870 0.177928 0.168814 0.178270 0.176438 0.162239 0.145986 0.329277 -0.289596 -0.424720 -0.099078 0.141884 0.339175 0.153068 -0.239111 0.133923 0.143311 0.453533 -0.211106 -0.210462 -0.203813
charge: 0.274529 0.012670 -0.316549 -0.084176 -0.101390 0.143430 -0.183571 0.148735 0.155422 -0.153584 0.640661 -0.432340 -0.432614 0.161095 -0.432175 0.126502 0.121701 0.126420 0.126453 0.121594 0.126258 0.126252 0.121520 0.126307 0.136251 0.147787 0.147045 -0.092732 -0.067102 -0.036653 -0.111444 0.152159 -0.120774 0.159396 -0.073051 0.148637 0.152715 -0.330032 0.082304 0.084016 0.098329
qa: 0.1220 -0.1815 -0.0574 0.2071 -0.3205 0.1704 -0.1950 0.1643 0.1593 -0.2699 0.6612 -0.5879 -0.5842 0.2261 -0.5916 0.1786 0.1693 0.1784 0.1786 0.1688 0.1779 0.1779 0.1688 0.1783 0.1764 0.1622 0.1460 0.3293 -0.2896 -0.4247 -0.0991 0.1419 0.3392 0.1531 -0.2391 0.1339 0.1433 0.4535 -0.2111 -0.2105 -0.2038
va: 1.6441 3.8360 3.7417 3.7482 3.8915 0.9649 3.9586 0.9495 0.9566 3.9788 4.1275 3.8436 3.8422 0.9462 3.8418 0.9538 0.9573 0.9539 0.9540 0.9573 0.9544 0.9541 0.9573 0.9536 0.9583 0.9600 0.9628 3.7189 4.0001 3.9865 3.8543 0.9643 3.7032 0.9865 3.8868 0.9667 0.9724 4.4279 1.0826 1.0846 1.0992
dispersion: -0.111639255 hartree
energy: -1398.997913115752 hartree
dipole: -10.758875419 10.548744182 -0.210131238 275.835272356 -278.719052279 -2.883779923 -19.497339629 21.276287898 1.778948269
dipolemethod: SCF
magnitude: 3.394848852 au
magnitude: 8.629020022 debye
zeropoint: 0.32323825 hartree
thermalvibcorrection: 0.02072778 hartree
thermalrotcorrection: 0.00141627 hartree
thermaltrasncorrection: 0.00141627 hartree
thermaltotal: -1398.65111454 hartree
thermalcorr: 0.02356032 hartree
nonthermalcorr: 0.32323825 hartree
totalcorr: 0.34679858 hartree
totalenthalpy: -1398.65017033 hartree
vibrat: 0.03836901 hartree
rotat: 0.01715499 hartree
total: 0.07666689 hartree
