program: Orca
programVersion: 6.1.x
elementType: Au C C C C H C H H C P C C H C H H H H H H H H H H H H C C C C H C H C H H O H
elementType: Au
keywords: optts freq wb97x-d3bj def2-tzvp(-f) def2/J tightopt verytightscf
charge: 1
multiplicity: 1
frequency: 0.00 0.00 0.00 0.00 0.00 0.00 -394.64 14.60 19.87 29.80 37.15 42.26 91.99 117.70 127.92 134.83 171.78 178.86 182.63 188.39 212.22 220.66 221.01 225.10 256.09 257.12 276.39 353.04 371.98 372.45 383.21 384.59 414.12 425.45 494.01 514.44 530.38 637.73 657.62 678.02 682.57 705.50 706.95 757.39 778.88 779.04 808.04 814.70 842.16 857.92 859.87 873.40 874.69 875.47 886.56 906.99 973.63 974.03 980.26 982.84 993.48 1000.33 1003.22 1021.56 1036.97 1041.45 1131.60 1151.77 1197.63 1205.59 1210.68 1218.62 1309.23 1316.72 1325.39 1336.20 1336.73 1337.11 1349.64 1376.86 1393.21 1443.22 1446.43 1446.67 1446.95 1453.59 1454.04 1460.55 1462.66 1485.90 1511.43 1576.76 1645.84 1674.15 1689.93 1847.53 3074.03 3074.59 3074.88 3097.85 3115.87 3152.53 3164.56 3165.10 3166.00 3172.09 3172.23 3172.44 3172.90 3177.74 3202.39 3218.80 3224.74 3236.09 3267.77 3372.78 3786.27
frequency: 14.60 19.87 29.80 37.15 42.26 91.99 117.70 127.92 134.83 171.78 178.86 182.63 188.39 212.22 220.66 221.01 225.10 256.09 257.12 276.39 353.04 371.98 372.45 383.21 384.59 414.12 425.45 494.01 514.44 530.38 637.73 657.62 678.02 682.57 705.50 706.95 757.39 778.88 779.04 808.04 814.70 842.16 857.92 859.87 873.40 874.69 875.47 886.56 906.99 973.63 974.03 980.26 982.84 993.48 1000.33 1003.22 1021.56 1036.97 1041.45 1131.60 1151.77 1197.63 1205.59 1210.68 1218.62 1309.23 1316.72 1325.39 1336.20 1336.73 1337.11 1349.64 1376.86 1393.21 1443.22 1446.43 1446.67 1446.95 1453.59 1454.04 1460.55 1462.66 1485.90 1511.43 1576.76 1645.84 1674.15 1689.93 1847.53 3074.03 3074.59 3074.88 3097.85 3115.87 3152.53 3164.56 3165.10 3166.00 3172.09 3172.23 3172.44 3172.90 3177.74 3202.39 3218.80 3224.74 3236.09 3267.77 3372.78 3786.27
formula: C15H21AuOP
InChI: InChI=1/C12H12O.C3H9P.Au/c1-3-4-5-10(2)11-6-8-12(13)9-7-11;1-4(2)3;/h1,6-9,13H,2,4-5H2;1-3H3;/rC15H21AuOP/c1-12(14-8-10-15(17)11-9-14)6-7-13(2)16-18(3,4)5/h2,8-11,17H,1,6-7H2,3-5H3
39 atoms
Au -0.112939 -1.643035 0.183044
C  0.985912 0.579402 1.243749
C  -0.223327 0.275761 1.060668
C  0.10236 2.879549 1.797049
C  1.237523 2.483767 2.423885
H  1.181001 1.923837 3.350194
C  -1.478149 1.029967 1.294652
H  -2.250128 0.402653 1.741385
H  -1.85284 1.370245 0.325515
C  -1.179148 2.247817 2.221477
P  -0.152281 -3.721198 -0.779724
C  0.492152 -3.74473 -2.469272
C  0.814094 -4.956427 0.120816
H  2.048386 0.450813 1.150111
C  -1.821368 -4.408145 -0.894285
H  -2.447789 -3.743141 -1.491465
H  -1.78698 -5.39493 -1.361902
H  -2.249098 -4.493448 0.106278
H  -0.09603 -3.067981 -3.09162
H  0.435064 -4.75728 -2.875667
H  1.531117 -3.410375 -2.467169
H  1.857658 -4.639847 0.165682
H  0.747034 -5.922421 -0.385237
H  0.428226 -5.04934 1.137546
H  2.211265 2.864103 2.137358
H  -2.026565 2.930065 2.161006
H  -1.091726 1.891183 3.247937
C  0.119823 3.740132 0.592428
C  -0.988121 4.518469 0.242836
C  1.244814 3.795086 -0.237128
C  -0.971595 5.336562 -0.874993
H  -1.878433 4.509666 0.859785
C  1.271499 4.598953 -1.363453
H  2.110539 3.181297 -0.016673
C  0.160478 5.378569 -1.683178
H  -1.831315 5.945991 -1.129692
H  2.149331 4.619395 -2.002145
O  0.130889 6.18847 -2.774762
H  0.978384 6.132037 -3.238727
totalener: -1136.93790986145973 hartree
nucrepener: 1507.24388385135512 hartree
electener: -2644.09934642919507 hartree
oneelecener: -4580.13528907698128 hartree
twoeener: 1936.03594264778599 hartree
cpcmener: -0.07657219784028 hartree
kineticenergy: 1042.70594193695797 hartree
exchangeener: -86.474661030822 hartree
dispersion: -0.105350262 hartree
temp: 298.15 k
press: 1.00 atm
thermalcorrenthalpy: 0.00094421 hartree
totalenthalpy: -1136.70010806 hartree
vibrat: 0.02982977 hartree
rotat: 0.01672231 hartree
transl: 0.02098647 hartree
total: 0.06753854 hartree
totalentropycorr: -0.06753854 hartree
gibbsenthalpy: -1136.76764660 hartree
gibbsminuselec: 0.27561352 hartree
dispersion: -0.106490855 hartree
dispersion: -0.106505858 hartree
dispersion: -0.106518204 hartree
dispersion: -0.106530024 hartree
dispersion: -0.106537319 hartree
dispersion: -0.106538888 hartree
dispersion: -0.106549508 hartree
dispersion: -0.106546568 hartree
dispersion: -0.106547252 hartree
dispersion: -0.106547980 hartree
dispersion: -0.106548585 hartree
dispersion: -0.106549348 hartree
dispersion: -0.106550384 hartree
dispersion: -0.106551579 hartree
dispersion: -0.106552783 hartree
dispersion: -0.106554076 hartree
dispersion: -0.106555462 hartree
dispersion: -0.106556980 hartree
dispersion: -0.106558489 hartree
dispersion: -0.106559974 hartree
dispersion: -0.106561378 hartree
dispersion: -0.106562691 hartree
dispersion: -0.106563797 hartree
dispersion: -0.106564731 hartree
dispersion: -0.106565511 hartree
dispersion: -0.106566252 hartree
dispersion: -0.106566762 hartree
dispersion: -0.106567185 hartree
dispersion: -0.106567584 hartree
dispersion: -0.106567843 hartree
dispersion: -0.106567979 hartree
dispersion: -0.106568104 hartree
dispersion: -0.106568114 hartree
dispersion: -0.106568074 hartree
dispersion: -0.106568082 hartree
dispersion: -0.106567859 hartree
dispersion: -0.106567535 hartree
dispersion: -0.106567347 hartree
dispersion: -0.106566927 hartree
dispersion: -0.106566649 hartree
dispersion: -0.106566188 hartree
dispersion: -0.106565572 hartree
dispersion: -0.106565072 hartree
dispersion: -0.106564527 hartree
dispersion: -0.106563901 hartree
dispersion: -0.106563366 hartree
dispersion: -0.106562572 hartree
dispersion: -0.106562103 hartree
dispersion: -0.106561463 hartree
dispersion: -0.106560963 hartree
dispersion: -0.106560312 hartree
dispersion: -0.106559916 hartree
dispersion: -0.106559326 hartree
dispersion: -0.106558977 hartree
dispersion: -0.106558329 hartree
dispersion: -0.106557973 hartree
dispersion: -0.106557405 hartree
dispersion: -0.106556840 hartree
dispersion: -0.106556447 hartree
dispersion: -0.106555793 hartree
dispersion: -0.106555433 hartree
dispersion: -0.106554905 hartree
dispersion: -0.106554736 hartree
dispersion: -0.106554203 hartree
dispersion: -0.106554169 hartree
dispersion: -0.106553938 hartree
dispersion: -0.106553614 hartree
dispersion: -0.106553520 hartree
dispersion: -0.106553307 hartree
dispersion: -0.106553224 hartree
dispersion: -0.106553077 hartree
dispersion: -0.106552930 hartree
dispersion: -0.106552940 hartree
elementType: Au C H P O
energy: -2098.6558 -524.0245 -281.7296 -281.4841 -280.9712 -280.5623 -280.5014 -280.1731 -280.1172 -280.1001 -280.0664 -280.0567 -279.8946 -279.8564 -279.8546 -279.8542 -279.8003 -182.4303 -132.1659 -132.1656 -132.1334 -116.8616 -67.6283 -67.1437 -67.1172 -32.8999 -27.9197 -27.0747 -25.5948 -25.4223 -24.6053 -24.2225 -23.8648 -23.0213 -23.0198 -21.5869 -20.9242 -20.4695 -19.1206 -18.8426 -18.5501 -18.3230 -17.0560 -16.6246 -16.3253 -15.9340 -15.7648 -15.5183 -15.3751 -15.3146 -15.3038 -14.9178 -14.8925 -14.8293 -14.4515 -14.4436 -14.0713 -13.9457 -13.8587 -13.6485 -13.2665 -13.0360 -12.9305 -12.8427 -12.6460 -12.3105 -12.2447 -11.9758 -11.7666 -11.7512 -11.5109 -10.7164 -10.2593 -10.2329 -10.0208 -8.6402 -0.3293 0.8844 1.1174 1.4184 1.7159 2.2787 2.3994 2.8270 3.1587 3.3321 3.4909 electronvolt
chargesum: 1.0000000
charge: 0.128494 -0.187045 -0.033231 0.186785 -0.336725 0.164095 -0.207219 0.163364 0.160233 -0.262969 0.661874 -0.584635 -0.586656 0.227245 -0.592170 0.178969 0.169582 0.179032 0.178601 0.168754 0.177804 0.177976 0.169261 0.178790 0.166514 0.161308 0.143062 0.304275 -0.299926 -0.277581 -0.217989 0.131199 -0.214795 0.139232 0.357251 0.121570 0.134164 -0.456514 0.328023
charge: 0.277959 0.017975 -0.310466 -0.097711 -0.120001 0.138311 -0.185240 0.148470 0.154877 -0.157040 0.641388 -0.432277 -0.432161 0.159763 -0.431841 0.126655 0.121732 0.126633 0.126512 0.121644 0.126277 0.126329 0.121723 0.126537 0.130482 0.145463 0.145049 -0.123076 -0.081763 -0.080678 -0.116429 0.149474 -0.123753 0.149987 -0.195063 0.147210 0.147901 0.010737 0.198410
qa: 0.1285 -0.1870 -0.0332 0.1868 -0.3367 0.1641 -0.2072 0.1634 0.1602 -0.2630 0.6619 -0.5846 -0.5867 0.2272 -0.5922 0.1790 0.1696 0.1790 0.1786 0.1688 0.1778 0.1780 0.1693 0.1788 0.1665 0.1613 0.1431 0.3043 -0.2999 -0.2776 -0.2180 0.1312 -0.2148 0.1392 0.3573 0.1216 0.1342 -0.4565 0.3280
va: 1.6453 3.8345 3.7219 3.7333 3.8797 0.9673 3.9522 0.9500 0.9556 3.9575 4.1317 3.8435 3.8422 0.9477 3.8427 0.9536 0.9572 0.9535 0.9537 0.9573 0.9543 0.9543 0.9572 0.9537 0.9626 0.9581 0.9631 3.6666 4.0020 3.9605 3.9074 0.9661 3.8551 0.9718 3.9716 0.9836 0.9698 2.0735 0.9082
dispersion: -0.106552804 hartree
energy: -1137.045336748237 hartree
dipole: 6.665730278 -5.881784215 0.783946063 228.587978382 -230.627397649 -2.039419267 -26.153014034 26.090227400 -0.062786634
dipolemethod: SCF
magnitude: 2.185805238 au
magnitude: 5.555875381 debye
zeropoint: 0.32292020 hartree
thermalvibcorrection: 0.01826858 hartree
thermalrotcorrection: 0.00141627 hartree
thermaltrasncorrection: 0.00141627 hartree
thermaltotal: -1136.70131543 hartree
thermalcorr: 0.02110112 hartree
nonthermalcorr: 0.32292020 hartree
totalcorr: 0.34402132 hartree
totalenthalpy: -1136.70037122 hartree
vibrat: 0.03319324 hartree
rotat: 0.01670140 hartree
total: 0.07088111 hartree
