program: Orca
programVersion: 6.1.x
elementType: Au C C C C H C H H C P C C H C H H H H H H H H H H H H C C C C H C H C H H C C H
elementType: Au
keywords: optts freq wb97x-d3bj def2-tzvp(-f) def2/J tightopt verytightscf
charge: 1
multiplicity: 1
frequency: 0.00 0.00 0.00 0.00 0.00 0.00 -379.49 14.58 20.40 30.37 37.81 48.82 75.27 109.61 119.90 126.72 150.69 171.88 181.31 184.85 185.71 204.62 222.78 223.19 225.92 246.54 256.73 258.12 323.61 339.08 371.79 388.24 416.61 425.32 485.53 490.39 550.64 564.07 637.70 655.71 660.47 685.84 689.39 692.76 706.85 727.77 770.16 778.69 779.20 808.90 817.60 825.74 869.56 873.79 874.48 877.70 882.89 890.72 909.72 974.18 974.25 980.43 994.41 1003.25 1007.90 1014.64 1022.70 1047.92 1053.14 1129.98 1155.40 1195.70 1208.79 1216.30 1249.63 1285.59 1313.81 1332.00 1336.50 1337.47 1349.63 1350.80 1388.66 1443.46 1443.85 1446.98 1447.27 1454.24 1454.61 1456.29 1460.97 1463.06 1510.90 1570.33 1628.68 1659.61 1694.28 1830.11 2244.89 3073.66 3074.20 3074.41 3098.26 3116.59 3153.82 3164.42 3164.71 3165.53 3171.43 3171.47 3171.83 3174.86 3177.57 3219.72 3224.00 3233.72 3240.33 3269.40 3365.52 3443.01
frequency: 14.58 20.40 30.37 37.81 48.82 75.27 109.61 119.90 126.72 150.69 171.88 181.31 184.85 185.71 204.62 222.78 223.19 225.92 246.54 256.73 258.12 323.61 339.08 371.79 388.24 416.61 425.32 485.53 490.39 550.64 564.07 637.70 655.71 660.47 685.84 689.39 692.76 706.85 727.77 770.16 778.69 779.20 808.90 817.60 825.74 869.56 873.79 874.48 877.70 882.89 890.72 909.72 974.18 974.25 980.43 994.41 1003.25 1007.90 1014.64 1022.70 1047.92 1053.14 1129.98 1155.40 1195.70 1208.79 1216.30 1249.63 1285.59 1313.81 1332.00 1336.50 1337.47 1349.63 1350.80 1388.66 1443.46 1443.85 1446.98 1447.27 1454.24 1454.61 1456.29 1460.97 1463.06 1510.90 1570.33 1628.68 1659.61 1694.28 1830.11 2244.89 3073.66 3074.20 3074.41 3098.26 3116.59 3153.82 3164.42 3164.71 3165.53 3171.43 3171.47 3171.83 3174.86 3177.57 3219.72 3224.00 3233.72 3240.33 3269.40 3365.52 3443.01
formula: C17H21AuP
InChI: InChI=1/C14H12.C3H9P.Au/c1-4-6-7-12(3)14-10-8-13(5-2)9-11-14;1-4(2)3;/h1-2,8-11H,3,6-7H2;1-3H3;/rC17H21AuP/c1-7-16-10-12-17(13-11-16)14(2)8-9-15(3)18-19(4,5)6/h1,3,10-13H,2,8-9H2,4-6H3
40 atoms
Au -0.127212 -1.805494 0.139502
C  0.939314 0.376649 1.362293
C  -0.259361 0.054605 1.12556
C  0.033441 2.594493 2.046034
C  1.158747 2.15187 2.660422
H  1.087122 1.536631 3.549872
C  -1.52518 0.784776 1.377975
H  -2.305249 0.127801 1.763607
H  -1.877265 1.186869 0.42417
C  -1.259322 1.943612 2.389731
P  -0.120697 -3.823884 -0.944646
C  0.538959 -3.736929 -2.626485
C  0.861989 -5.091689 -0.10874
H  2.00313 0.257016 1.266409
C  -1.774596 -4.535587 -1.115532
H  -2.408045 -3.85064 -1.682126
H  -1.716137 -5.494114 -1.636547
H  -2.210835 -4.684477 -0.1261
H  -0.054915 -3.03427 -3.213766
H  0.502526 -4.72463 -3.092192
H  1.572219 -3.386468 -2.594447
H  1.898422 -4.757701 -0.033207
H  0.81991 -6.026902 -0.672033
H  0.468034 -5.252965 0.896339
H  2.135009 2.553568 2.41353
H  -2.103036 2.63134 2.337756
H  -1.206655 1.523948 3.394358
C  0.084111 3.551394 0.913335
C  -0.971053 4.436377 0.682847
C  1.187068 3.585219 0.054469
C  -0.92133 5.342108 -0.36511
H  -1.834286 4.440162 1.336743
C  1.237864 4.478735 -1.000529
H  2.006201 2.89036 0.196762
C  0.182684 5.369178 -1.217968
H  -1.741344 6.032112 -0.526082
H  2.093437 4.488091 -1.665751
C  0.231578 6.302886 -2.312631
C  0.268286 7.08588 -3.222305
H  0.302051 7.781678 -4.033838
totalener: -1137.86738385943045 hartree
nucrepener: 1566.33185645125081 hartree
electener: -2704.11609567146479 hartree
oneelecener: -4695.44866214006743 hartree
twoeener: 1991.33256646860241 hartree
cpcmener: -0.07752555466913 hartree
kineticenergy: 1044.03252337282925 hartree
exchangeener: -87.790251103920 hartree
dispersion: -0.110914735 hartree
dispersion: -0.110898596 hartree
dispersion: -0.110992250 hartree
dispersion: -0.110983114 hartree
dispersion: -0.110945705 hartree
dispersion: -0.110930710 hartree
dispersion: -0.110909870 hartree
dispersion: -0.110910543 hartree
dispersion: -0.110909989 hartree
dispersion: -0.110908963 hartree
dispersion: -0.110911811 hartree
dispersion: -0.110910104 hartree
dispersion: -0.110908236 hartree
dispersion: -0.110910434 hartree
dispersion: -0.110911740 hartree
dispersion: -0.110914200 hartree
dispersion: -0.110915664 hartree
dispersion: -0.110912507 hartree
dispersion: -0.110915646 hartree
dispersion: -0.110913540 hartree
dispersion: -0.110921873 hartree
dispersion: -0.110920748 hartree
dispersion: -0.110911673 hartree
dispersion: -0.110917570 hartree
dispersion: -0.110913582 hartree
dispersion: -0.110916273 hartree
dispersion: -0.110914387 hartree
dispersion: -0.110915675 hartree
dispersion: -0.110914742 hartree
dispersion: -0.110915375 hartree
dispersion: -0.110915001 hartree
dispersion: -0.110915258 hartree
dispersion: -0.110915165 hartree
dispersion: -0.110915199 hartree
dispersion: -0.110915232 hartree
dispersion: -0.110915214 hartree
dispersion: -0.110915321 hartree
dispersion: -0.110915262 hartree
dispersion: -0.110915422 hartree
dispersion: -0.110915496 hartree
dispersion: -0.110915379 hartree
dispersion: -0.110915577 hartree
dispersion: -0.110915476 hartree
dispersion: -0.110915649 hartree
dispersion: -0.110915566 hartree
dispersion: -0.110915767 hartree
dispersion: -0.110915671 hartree
dispersion: -0.110915847 hartree
dispersion: -0.110915922 hartree
dispersion: -0.110915827 hartree
elementType: Au C H P
energy: -2098.6477 -281.5166 -281.1547 -280.8420 -280.5663 -280.5562 -280.5319 -280.2822 -280.1912 -280.1848 -280.1629 -280.1623 -280.1369 -280.0973 -279.8546 -279.8526 -279.8523 -279.7976 -182.4224 -132.1581 -132.1580 -132.1252 -116.8490 -67.6145 -67.1287 -67.1064 -28.2160 -27.3801 -25.9746 -25.4278 -25.0416 -24.7015 -24.2614 -23.8038 -23.0176 -23.0165 -21.6677 -21.2281 -20.4732 -19.2419 -18.8523 -18.7158 -18.3669 -17.3216 -16.7436 -16.6092 -16.3523 -15.9603 -15.7726 -15.4703 -15.4187 -15.3122 -15.2925 -15.0055 -14.6889 -14.4467 -14.4408 -14.2611 -14.0026 -13.9430 -13.6110 -13.3702 -12.9887 -12.8896 -12.7822 -12.6032 -12.3733 -12.1963 -11.8558 -11.7530 -11.7391 -11.4979 -10.9737 -10.7143 -10.2471 -10.2328 -10.1063 -9.0059 -0.5719 0.5842 1.0501 1.2709 1.5484 1.9799 2.3343 2.6852 2.9835 3.1378 3.4411 electronvolt
chargesum: 1.0000000
charge: 0.124123 -0.184405 -0.048317 0.175077 -0.320296 0.167724 -0.200989 0.164036 0.159786 -0.265269 0.660617 -0.584441 -0.586812 0.226616 -0.592108 0.178785 0.169460 0.178813 0.178606 0.168636 0.177767 0.177899 0.169235 0.178563 0.174646 0.161938 0.144721 0.315684 -0.295023 -0.256295 -0.247404 0.136881 -0.260592 0.143080 0.138892 0.136397 0.134736 0.008539 -0.126328 0.217023
charge: 0.275572 0.014525 -0.314779 -0.087998 -0.104054 0.142075 -0.183978 0.148585 0.155366 -0.154439 0.640777 -0.432386 -0.432391 0.160702 -0.432111 0.126608 0.121652 0.126521 0.126464 0.121590 0.126269 0.126255 0.121647 0.126420 0.134819 0.147221 0.146433 -0.094950 -0.078854 -0.078137 -0.073579 0.151173 -0.073752 0.151655 -0.139522 0.152424 0.152294 -0.075824 -0.069282 0.128986
qa: 0.1241 -0.1844 -0.0483 0.1751 -0.3203 0.1677 -0.2010 0.1640 0.1598 -0.2653 0.6606 -0.5844 -0.5868 0.2266 -0.5921 0.1788 0.1695 0.1788 0.1786 0.1686 0.1778 0.1779 0.1692 0.1786 0.1746 0.1619 0.1447 0.3157 -0.2950 -0.2563 -0.2474 0.1369 -0.2606 0.1431 0.1389 0.1364 0.1347 0.0085 -0.1263 0.2170
va: 1.6445 3.8369 3.7362 3.7664 3.8876 0.9667 3.9588 0.9496 0.9562 3.9741 4.1290 3.8433 3.8417 0.9466 3.8425 0.9537 0.9572 0.9536 0.9537 0.9573 0.9543 0.9543 0.9573 0.9537 0.9588 0.9595 0.9629 3.7861 3.9530 3.9241 3.8977 0.9669 3.9320 0.9693 3.7911 0.9738 0.9752 3.4374 3.3109 0.9656
dispersion: -0.110916020 hartree
energy: -1137.978305019718 hartree
dipole: 7.743080108 -7.601458994 0.141621114 250.604631174 -252.971617420 -2.366986245 -20.451262660 21.004700623 0.553437963
dipolemethod: SCF
magnitude: 2.434948460 au
magnitude: 6.189147127 debye
temp: 298.15 k
press: 1.00 atm
zeropoint: 0.32793722 hartree
thermalvibcorrection: 0.01914268 hartree
thermalrotcorrection: 0.00141627 hartree
thermaltrasncorrection: 0.00141627 hartree
thermaltotal: -1137.62839258 hartree
thermalcorr: 0.02197522 hartree
nonthermalcorr: 0.32793722 hartree
totalcorr: 0.34991244 hartree
thermalcorrenthalpy: 0.00094421 hartree
totalenthalpy: -1137.62744837 hartree
vibrat: 0.03479663 hartree
rotat: 0.01687018 hartree
transl: 0.02101176 hartree
total: 0.07267857 hartree
totalentropycorr: -0.07267857 hartree
gibbsenthalpy: -1137.70012694 hartree
gibbsminuselec: 0.27817808 hartree
