program: Orca
programVersion: 6.1.x
elementType: C H H C C H C H H C C H H Au P C C C H H H H H H H H H C C C C H C H C H C H H H H
elementType: Au
keywords: optts freq wb97x-d3bj def2-tzvp(-f) def2/J tightopt verytightscf
charge: 1
multiplicity: 1
frequency: 0.00 0.00 0.00 0.00 0.00 0.00 -14.33 14.32 28.75 34.41 49.96 73.19 88.45 115.39 128.83 147.37 160.63 179.30 185.07 197.22 210.08 217.87 223.04 223.57 229.14 259.36 262.06 327.75 362.74 368.86 392.31 431.11 447.11 461.00 514.89 531.92 599.81 605.19 667.40 686.65 705.69 713.84 772.98 773.90 793.64 805.70 827.24 848.42 871.01 871.15 882.86 928.88 945.69 962.61 970.94 970.95 980.21 992.44 1004.74 1017.05 1026.79 1039.91 1042.33 1069.44 1084.60 1089.70 1134.49 1143.10 1178.61 1208.06 1241.44 1249.30 1295.89 1306.12 1311.94 1334.73 1334.96 1341.43 1347.72 1358.68 1372.22 1382.24 1392.93 1423.96 1425.69 1445.97 1449.03 1449.23 1454.42 1455.88 1456.10 1462.61 1474.66 1478.08 1484.23 1508.91 1553.40 1647.79 1675.74 1693.45 2987.81 2995.31 3053.36 3070.97 3071.14 3071.63 3071.86 3128.94 3137.27 3140.30 3159.17 3160.84 3160.98 3161.65 3167.24 3167.33 3167.38 3169.09 3182.28 3206.08 3231.45 3244.29 3260.86
frequency: 14.32 28.75 34.41 49.96 73.19 88.45 115.39 128.83 147.37 160.63 179.30 185.07 197.22 210.08 217.87 223.04 223.57 229.14 259.36 262.06 327.75 362.74 368.86 392.31 431.11 447.11 461.00 514.89 531.92 599.81 605.19 667.40 686.65 705.69 713.84 772.98 773.90 793.64 805.70 827.24 848.42 871.01 871.15 882.86 928.88 945.69 962.61 970.94 970.95 980.21 992.44 1004.74 1017.05 1026.79 1039.91 1042.33 1069.44 1084.60 1089.70 1134.49 1143.10 1178.61 1208.06 1241.44 1249.30 1295.89 1306.12 1311.94 1334.73 1334.96 1341.43 1347.72 1358.68 1372.22 1382.24 1392.93 1423.96 1425.69 1445.97 1449.03 1449.23 1454.42 1455.88 1456.10 1462.61 1474.66 1478.08 1484.23 1508.91 1553.40 1647.79 1675.74 1693.45 2987.81 2995.31 3053.36 3070.97 3071.14 3071.63 3071.86 3128.94 3137.27 3140.30 3159.17 3160.84 3160.98 3161.65 3167.24 3167.33 3167.38 3169.09 3182.28 3206.08 3231.45 3244.29 3260.86
formula: C16H23AuP
InChI: InChI=1/C13H14.C3H9P.Au/c1-11-6-5-9-13(10-11)12-7-3-2-4-8-12;1-4(2)3;/h3,5-6,9-10H,4,7-8H2,1H3;1-3H3;/rC16H23AuP/c1-13-6-5-7-15(12-13)14-8-10-16(11-9-14)17-18(2,3)4/h5-7,10,12H,8-9,11H2,1-4H3
41 atoms
C  -0.85254 -1.058639 0.53561
H  -0.868996 -1.960087 -0.077931
H  -1.899778 -0.772094 0.693945
C  -0.113434 0.071338 -0.153158
C  0.340519 1.034294 0.655253
H  0.877563 1.898775 0.275871
C  0.096899 1.049506 2.146371
H  0.83418 1.658656 2.67039
H  -0.87424 1.532695 2.362844
C  -0.029953 -0.277784 2.787975
C  -0.220468 -1.423374 1.881934
H  0.815753 -1.761243 1.697713
H  -0.737239 -2.250644 2.363622
Au 0.127618 0.085457 -2.198711
P  0.390474 0.100623 -4.493061
C  -0.768823 1.187794 -5.36604
C  2.026265 0.648483 -5.05138
C  0.165535 -1.517951 -5.278853
H  -0.839906 -1.887469 -5.067856
H  0.304027 -1.438879 -6.35979
H  0.890689 -2.224505 -4.870319
H  -1.792297 0.871522 -5.155099
H  -0.590733 1.148068 -6.443332
H  -0.640337 2.213337 -5.014193
H  2.211508 1.662545 -4.691678
H  2.081019 0.634052 -6.142528
H  2.791028 -0.013477 -4.640395
C  0.046831 -0.425946 4.203029
C  0.045771 -1.707487 4.79386
C  0.134405 0.711739 5.041044
C  0.147211 -1.834132 6.164407
H  -0.014874 -2.598579 4.184654
C  0.207988 0.591915 6.414181
H  0.1260 1.704202 4.609467
C  0.220848 -0.697451 6.961683
H  0.161466 -2.817195 6.619618
C  0.278915 1.79921 7.309751
H  0.288778 -0.808896 8.039825
H  -0.567619 1.815009 8.001064
H  1.193276 1.781002 7.908407
H  0.265939 2.721073 6.726378
totalener: -1101.05128486923263 hartree
nucrepener: 1476.07785790393018 hartree
electener: -2577.04773115963917 hartree
oneelecener: -4467.37331152729257 hartree
twoeener: 1890.32558036765340 hartree
cpcmener: -0.07303964540537 hartree
kineticenergy: 1006.76736080854323 hartree
exchangeener: -84.555499361177 hartree
dispersion: -0.106284331 hartree
temp: 298.15 k
press: 1.00 atm
thermalcorrenthalpy: 0.00094421 hartree
totalenthalpy: -1100.78814376 hartree
vibrat: 0.02976169 hartree
rotat: 0.01671865 hartree
transl: 0.02098018 hartree
total: 0.06746052 hartree
totalentropycorr: -0.06746052 hartree
gibbsenthalpy: -1100.85560428 hartree
gibbsminuselec: 0.30196492 hartree
dispersion: -0.106350230 hartree
dispersion: -0.106423123 hartree
dispersion: -0.106476189 hartree
dispersion: -0.106515181 hartree
dispersion: -0.106554515 hartree
dispersion: -0.106598878 hartree
dispersion: -0.106655475 hartree
dispersion: -0.106705906 hartree
dispersion: -0.106758845 hartree
dispersion: -0.106782835 hartree
dispersion: -0.106799758 hartree
dispersion: -0.106815756 hartree
dispersion: -0.106851465 hartree
dispersion: -0.106927799 hartree
dispersion: -0.107119082 hartree
dispersion: -0.107075035 hartree
dispersion: -0.107088440 hartree
dispersion: -0.107066748 hartree
dispersion: -0.107055854 hartree
dispersion: -0.107046218 hartree
dispersion: -0.107036418 hartree
dispersion: -0.107025184 hartree
dispersion: -0.107002751 hartree
dispersion: -0.106988019 hartree
dispersion: -0.106990689 hartree
dispersion: -0.106996921 hartree
dispersion: -0.106985129 hartree
dispersion: -0.107006672 hartree
dispersion: -0.107008391 hartree
dispersion: -0.107018377 hartree
dispersion: -0.107024143 hartree
dispersion: -0.107036219 hartree
dispersion: -0.107036141 hartree
dispersion: -0.107049571 hartree
dispersion: -0.107059231 hartree
dispersion: -0.107071194 hartree
dispersion: -0.107085512 hartree
dispersion: -0.107100292 hartree
dispersion: -0.107109301 hartree
dispersion: -0.107106461 hartree
dispersion: -0.107096137 hartree
dispersion: -0.107079428 hartree
dispersion: -0.107120374 hartree
dispersion: -0.107076172 hartree
dispersion: -0.107078013 hartree
dispersion: -0.107077290 hartree
dispersion: -0.107078138 hartree
dispersion: -0.107073864 hartree
dispersion: -0.107059176 hartree
dispersion: -0.107060003 hartree
dispersion: -0.107062874 hartree
dispersion: -0.107062435 hartree
dispersion: -0.107065725 hartree
dispersion: -0.107064171 hartree
dispersion: -0.107065985 hartree
dispersion: -0.107064847 hartree
dispersion: -0.107066157 hartree
dispersion: -0.107064975 hartree
dispersion: -0.107066048 hartree
dispersion: -0.107064588 hartree
dispersion: -0.107066026 hartree
dispersion: -0.107065017 hartree
dispersion: -0.107067250 hartree
dispersion: -0.107065996 hartree
dispersion: -0.107067195 hartree
dispersion: -0.107066124 hartree
dispersion: -0.107067547 hartree
dispersion: -0.107066654 hartree
dispersion: -0.107068128 hartree
dispersion: -0.107067785 hartree
dispersion: -0.107067986 hartree
dispersion: -0.107067800 hartree
dispersion: -0.107067482 hartree
dispersion: -0.107066311 hartree
dispersion: -0.107064614 hartree
dispersion: -0.107062396 hartree
dispersion: -0.107062294 hartree
dispersion: -0.107062252 hartree
dispersion: -0.107062349 hartree
elementType: C H Au P
energy: -2098.1978 -282.9409 -280.8920 -280.8098 -280.7415 -280.6979 -280.6102 -280.3936 -280.3606 -280.3347 -279.7353 -279.6484 -279.6455 -279.6455 -279.6442 -279.3907 -279.3155 -181.9831 -131.7229 -131.7221 -131.6735 -116.2162 -66.9325 -66.4781 -66.4725 -28.6622 -27.5869 -25.7936 -25.3948 -25.1475 -24.6572 -23.9083 -22.8865 -22.7931 -22.7895 -21.5098 -21.1339 -20.2239 -19.1206 -18.5681 -18.2424 -17.2294 -16.8987 -16.6769 -16.4256 -15.7165 -15.6162 -15.0971 -15.0919 -15.0803 -15.0437 -14.9632 -14.6997 -14.5719 -14.2351 -14.2330 -13.9302 -13.8743 -13.7970 -13.7417 -13.3600 -13.2166 -12.9248 -12.7634 -12.5770 -12.5290 -12.1804 -11.6272 -11.1407 -11.1106 -11.0860 -10.6706 -10.1448 -9.8551 -9.2200 -9.1335 -1.9642 1.0670 1.2519 1.3602 1.9703 2.3476 2.7677 2.9259 3.2405 3.4914 3.5935 electronvolt
chargesum: 1.0000000
charge: -0.151896 0.140903 0.123307 -0.270173 -0.239560 0.120616 -0.157804 0.177710 0.191988 0.176328 -0.245355 0.191873 0.175761 -0.006042 0.642247 -0.588107 -0.591393 -0.593405 0.172916 0.161366 0.173031 0.173276 0.161025 0.173229 0.173118 0.161425 0.173091 0.345274 -0.229472 -0.350863 -0.117202 0.153338 0.317678 0.161269 -0.164309 0.140051 -0.470119 0.148027 0.150263 0.150518 0.146076
charge: -0.222393 0.135340 0.140846 -0.420934 -0.219269 0.133371 -0.162435 0.163831 0.193593 0.122642 -0.161042 0.192799 0.153786 0.193488 0.622471 -0.441136 -0.440970 -0.440889 0.123328 0.117633 0.123259 0.123319 0.117487 0.123373 0.123434 0.117559 0.123322 -0.114258 -0.024722 -0.006166 -0.109798 0.156846 -0.143359 0.159150 -0.020262 0.151180 -0.222062 0.156727 0.128242 0.128295 0.124374
qa: -0.1519 0.1409 0.1233 -0.2702 -0.2396 0.1206 -0.1578 0.1777 0.1920 0.1763 -0.2454 0.1919 0.1758 -0.0060 0.6422 -0.5881 -0.5914 -0.5934 0.1729 0.1614 0.1730 0.1733 0.1610 0.1732 0.1731 0.1614 0.1731 0.3453 -0.2295 -0.3509 -0.1172 0.1533 0.3177 0.1613 -0.1643 0.1401 -0.4701 0.1480 0.1503 0.1505 0.1461
va: 3.9513 0.9418 0.9656 3.7708 4.0239 0.9532 3.8421 0.9541 0.9494 3.5983 3.9439 0.9537 0.9512 1.6478 4.0081 3.8360 3.8365 3.8363 0.9558 0.9589 0.9556 0.9552 0.9587 0.9555 0.9560 0.9587 0.9556 3.5560 3.9219 3.9116 3.9091 0.9632 3.7838 0.9593 3.9336 0.9657 3.8628 0.9567 0.9548 0.9547 0.9664
dispersion: -0.107062357 hartree
energy: -1101.158613841635 hartree
dipole: 2.364450522 -2.336279709 0.028170813 -12.203405837 11.599356925 -0.604048912 292.209130036 -288.327015015 3.882115021
dipolemethod: SCF
magnitude: 3.928929335 au
magnitude: 9.986544727 debye
zeropoint: 0.34869105 hartree
thermalvibcorrection: 0.01790285 hartree
thermalrotcorrection: 0.00141627 hartree
thermaltrasncorrection: 0.00141627 hartree
thermaltotal: -1100.78918740 hartree
thermalcorr: 0.02073540 hartree
nonthermalcorr: 0.34869105 hartree
totalcorr: 0.36942644 hartree
totalenthalpy: -1100.78824319 hartree
vibrat: 0.03234010 hartree
rotat: 0.01665107 hartree
total: 0.06997134 hartree
