program: Orca
programVersion: 6.1.x
elementType: C H H C C H C H H C C H H Au P C C C H H H H H H H H H C C C C H C H C H H C C C H H H H H
elementType: Au
keywords: optts freq wb97x-d3bj def2-tzvp(-f) def2/J tightopt verytightscf
charge: 1
multiplicity: 1
frequency: 0.00 0.00 0.00 0.00 0.00 0.00 -185.68 15.56 20.62 31.66 39.21 44.01 65.64 91.76 107.90 137.12 153.12 165.82 178.75 183.86 185.44 209.43 216.46 221.61 224.87 255.50 259.06 268.03 297.80 322.34 364.82 392.31 419.51 436.10 456.56 495.81 513.90 568.05 596.40 651.69 674.77 705.52 739.70 765.56 775.42 776.04 783.14 807.59 811.96 845.09 848.56 855.35 863.39 866.55 871.88 873.01 894.53 936.67 940.48 955.08 972.74 972.87 973.56 980.81 1007.99 1013.30 1017.27 1037.06 1057.04 1062.37 1071.38 1094.22 1094.87 1118.45 1139.75 1160.35 1177.49 1189.45 1204.86 1211.28 1216.69 1232.68 1256.61 1270.29 1305.17 1320.86 1335.63 1336.57 1344.36 1349.00 1355.76 1383.94 1423.16 1427.31 1445.32 1448.39 1448.71 1455.18 1455.79 1456.70 1462.11 1468.16 1472.89 1478.17 1519.42 1524.78 1575.92 1583.32 1636.13 1677.34 3054.99 3069.75 3072.29 3072.85 3073.20 3138.70 3147.47 3162.18 3162.60 3162.70 3163.66 3167.13 3168.53 3168.82 3169.18 3174.72 3203.82 3211.80 3218.24 3219.89 3233.88 3240.83 3247.18 3247.74 3259.64
frequency: 15.56 20.62 31.66 39.21 44.01 65.64 91.76 107.90 137.12 153.12 165.82 178.75 183.86 185.44 209.43 216.46 221.61 224.87 255.50 259.06 268.03 297.80 322.34 364.82 392.31 419.51 436.10 456.56 495.81 513.90 568.05 596.40 651.69 674.77 705.52 739.70 765.56 775.42 776.04 783.14 807.59 811.96 845.09 848.56 855.35 863.39 866.55 871.88 873.01 894.53 936.67 940.48 955.08 972.74 972.87 973.56 980.81 1007.99 1013.30 1017.27 1037.06 1057.04 1062.37 1071.38 1094.22 1094.87 1118.45 1139.75 1160.35 1177.49 1189.45 1204.86 1211.28 1216.69 1232.68 1256.61 1270.29 1305.17 1320.86 1335.63 1336.57 1344.36 1349.00 1355.76 1383.94 1423.16 1427.31 1445.32 1448.39 1448.71 1455.18 1455.79 1456.70 1462.11 1468.16 1472.89 1478.17 1519.42 1524.78 1575.92 1583.32 1636.13 1677.34 3054.99 3069.75 3072.29 3072.85 3073.20 3138.70 3147.47 3162.18 3162.60 3162.70 3163.66 3167.13 3168.53 3168.82 3169.18 3174.72 3203.82 3211.80 3218.24 3219.89 3233.88 3240.83 3247.18 3247.74 3259.64
formula: C18H25AuP
InChI: InChI=1/C15H16.C3H9P.Au/c1-2-4-12(5-3-1)13-6-8-14(9-7-13)15-10-11-15;1-4(2)3;/h2,6-9,15H,3-5,10-11H2;1-3H3;/rC18H25AuP/c1-20(2,3)19-18-12-10-17(11-13-18)16-8-6-15(7-9-16)14-4-5-14/h6-9,12,14H,4-5,10-11,13H2,1-3H3
45 atoms
C  -1.369334 2.188273 -0.140965
H  -2.255768 1.799257 -0.64027
H  -1.229054 3.213793 -0.506925
C  -0.125242 1.397347 -0.48132
C  0.894179 1.573744 0.384878
H  1.788312 0.963531 0.421794
C  0.829124 2.722821 1.436079
H  1.760728 2.791894 1.984733
H  0.525421 3.664165 0.982451
C  -0.236341 1.957855 2.039799
C  -1.565917 2.141325 1.381624
H  -2.25995 1.349233 1.652756
H  -1.975199 3.080854 1.774324
Au -0.026976 0.175968 -2.131067
P  0.07278 -1.192355 -3.989643
C  1.413854 -0.774398 -5.133714
C  0.332655 -2.941406 -3.595389
C  -1.4256 -1.167536 -5.007397
H  -1.608485 -0.150819 -5.360503
H  -1.310868 -1.83537 -5.864411
H  -2.278477 -1.489576 -4.406846
H  1.282625 0.249619 -5.48867
H  1.411501 -1.458171 -5.98591
H  2.370686 -0.845243 -4.612923
H  1.269625 -3.054504 -3.046704
H  0.374174 -3.533478 -4.512681
H  -0.486599 -3.298718 -2.968595
C  -0.038194 1.103059 3.194038
C  -0.880682 0.004986 3.437842
C  0.991297 1.36669 4.110542
C  -0.694654 -0.79788 4.544032
H  -1.666551 -0.243564 2.735785
C  1.160691 0.570018 5.226696
H  1.643788 2.219045 3.968455
C  0.327663 -0.527833 5.462972
H  -1.351671 -1.647143 4.693369
H  1.950456 0.798866 5.93407
C  0.550451 -1.361875 6.666987
C  -0.619142 -1.983167 7.396469
C  0.312504 -2.854399 6.621284
H  1.375815 -1.030929 7.285834
H  -1.606139 -1.802295 6.987123
H  -0.564114 -2.004921 8.478073
H  1.010395 -3.476393 7.168526
H  -0.038705 -3.268662 5.683501
totalener: -1178.50383286252350 hartree
nucrepener: 1705.77417426680631 hartree
electener: -2884.19826732931188 hartree
oneelecener: -5027.90475868367594 hartree
twoeener: 2143.70649135436406 hartree
cpcmener: -0.06949038816688 hartree
kineticenergy: 1083.81992602959508 hartree
exchangeener: -91.974835173898 hartree
dispersion: -0.115914234 hartree
temp: 298.15 k
press: 1.00 atm
thermalcorrenthalpy: 0.00094421 hartree
totalenthalpy: -1178.21333209 hartree
vibrat: 0.03242584 hartree
rotat: 0.01711154 hartree
transl: 0.02106102 hartree
total: 0.07059839 hartree
totalentropycorr: -0.07059839 hartree
gibbsenthalpy: -1178.28393049 hartree
gibbsminuselec: 0.33581661 hartree
dispersion: -0.115964802 hartree
dispersion: -0.116025614 hartree
dispersion: -0.116057022 hartree
dispersion: -0.116077639 hartree
dispersion: -0.116091616 hartree
dispersion: -0.116097282 hartree
dispersion: -0.116095431 hartree
dispersion: -0.116088120 hartree
dispersion: -0.116073918 hartree
dispersion: -0.116047506 hartree
dispersion: -0.116002073 hartree
dispersion: -0.115929956 hartree
dispersion: -0.115835263 hartree
dispersion: -0.115854068 hartree
dispersion: -0.116053918 hartree
dispersion: -0.116104684 hartree
dispersion: -0.116166150 hartree
dispersion: -0.116187302 hartree
dispersion: -0.116183631 hartree
dispersion: -0.116231228 hartree
dispersion: -0.116217337 hartree
dispersion: -0.116244192 hartree
dispersion: -0.116220486 hartree
dispersion: -0.116228241 hartree
dispersion: -0.116224027 hartree
elementType: C H Au P
energy: -2098.3470 -282.4407 -280.6905 -280.5414 -280.5353 -280.3979 -280.3847 -280.3707 -280.3190 -280.2165 -280.1130 -280.0261 -280.0031 -279.9618 -279.8080 -279.8003 -279.7337 -279.7317 -279.7282 -182.1333 -131.8717 -131.8713 -131.8265 -116.5090 -67.2432 -66.7765 -66.7500 -28.6748 -28.0241 -27.2601 -25.3964 -25.2528 -24.8933 -24.5465 -23.8954 -22.8838 -22.8805 -21.8105 -21.1548 -20.5358 -20.0533 -19.5692 -19.0880 -18.6997 -18.3720 -17.6420 -17.2374 -16.6341 -16.4432 -16.0524 -15.7691 -15.6978 -15.2541 -15.1753 -15.1729 -15.0969 -14.7729 -14.4933 -14.3359 -14.3205 -14.2784 -14.1378 -14.0795 -13.8244 -13.3598 -13.0610 -13.0368 -12.9300 -12.7682 -12.6936 -12.5965 -12.2347 -12.0220 -11.8672 -11.4156 -11.3806 -11.3587 -11.2844 -10.2567 -10.1835 -10.0566 -9.8311 -8.9665 -1.1803 1.0080 1.2531 1.3159 2.0916 2.3168 2.7073 2.9909 3.4403 3.4947 3.6030 electronvolt
chargesum: 1.0000000
charge: -0.168008 0.146676 0.152774 -0.225019 -0.133682 0.146097 -0.197361 0.163180 0.144739 0.342196 -0.298847 0.146436 0.161213 0.039483 0.649476 -0.589251 -0.588818 -0.593675 0.175239 0.164288 0.174665 0.175166 0.164144 0.174856 0.174714 0.164158 0.174621 0.304293 -0.286646 -0.251264 -0.282551 0.142760 -0.336810 0.139270 0.399121 0.140587 0.126337 -0.163730 -0.193639 -0.193870 0.117050 0.127381 0.122657 0.122553 0.127044
charge: -0.210033 0.139790 0.151436 -0.331050 -0.138245 0.146242 -0.130452 0.148515 0.153180 0.047862 -0.156408 0.144617 0.162963 0.230787 0.628755 -0.438094 -0.438194 -0.438090 0.124523 0.119126 0.124379 0.124528 0.119008 0.124473 0.124446 0.119103 0.124301 -0.120052 -0.058311 -0.055599 -0.091612 0.152136 -0.094497 0.153258 -0.082455 0.151447 0.149663 -0.161827 -0.184653 -0.184790 0.146841 0.126180 0.125408 0.125385 0.126010
qa: -0.1680 0.1467 0.1528 -0.2250 -0.1337 0.1461 -0.1974 0.1632 0.1447 0.3422 -0.2988 0.1464 0.1612 0.0395 0.6495 -0.5893 -0.5888 -0.5937 0.1752 0.1643 0.1747 0.1752 0.1641 0.1749 0.1747 0.1642 0.1746 0.3043 -0.2866 -0.2513 -0.2826 0.1428 -0.3368 0.1393 0.3991 0.1406 0.1263 -0.1637 -0.1936 -0.1939 0.1170 0.1274 0.1227 0.1226 0.1270
va: 3.8890 0.9522 0.9646 3.7270 3.8883 0.9534 3.9456 0.9630 0.9562 3.5820 4.0034 0.9667 0.9629 1.6550 4.0251 3.8390 3.8409 3.8381 0.9552 0.9582 0.9554 0.9550 0.9581 0.9553 0.9555 0.9583 0.9551 3.6732 3.9748 3.8584 3.8620 0.9702 3.9030 0.9698 3.7134 0.9772 0.9741 3.7650 3.8840 3.8841 0.9558 0.9699 0.9733 0.9734 0.9700
dispersion: -0.116222367 hartree
energy: -1178.621184702924 hartree
dipole: 0.421928602 -0.541238162 -0.119309560 -28.332479958 28.501237775 0.168757818 318.024749544 -317.548212014 0.476537530
dipolemethod: SCF
magnitude: 0.519424672 au
magnitude: 1.320272591 debye
zeropoint: 0.38413622 hartree
thermalvibcorrection: 0.01936110 hartree
thermalrotcorrection: 0.00141627 hartree
thermaltrasncorrection: 0.00141627 hartree
thermaltotal: -1178.21485484 hartree
thermalcorr: 0.02219364 hartree
nonthermalcorr: 0.38413622 hartree
totalcorr: 0.40632986 hartree
totalenthalpy: -1178.21391064 hartree
vibrat: 0.03510271 hartree
rotat: 0.01708175 hartree
total: 0.07324548 hartree
