program: Orca
programVersion: 6.1.x
elementType: C H H C C H C H H C C H H Au P C C C H H H H H H H H H C C C C H C H C H H N C C H H H H H H
elementType: Au
keywords: optts freq wb97x-d3bj def2-tzvp(-f) def2/J tightopt verytightscf
charge: 1
multiplicity: 1
frequency: 0.00 0.00 0.00 0.00 0.00 0.00 -147.44 4.25 15.94 32.61 41.23 50.51 61.38 80.77 94.21 120.36 146.27 154.40 170.56 182.31 185.55 187.85 201.48 219.37 220.75 225.26 233.14 254.39 259.34 266.35 288.01 309.14 364.66 402.33 430.80 442.24 451.34 490.26 514.44 523.71 554.60 592.51 653.75 676.43 705.66 736.70 761.38 776.42 776.67 788.38 806.46 830.35 851.85 865.36 871.92 872.96 895.36 909.51 950.05 971.93 972.45 980.87 981.29 986.26 994.96 1002.06 1014.52 1026.51 1046.19 1092.45 1098.59 1117.70 1146.30 1148.08 1157.49 1173.29 1182.93 1211.27 1227.25 1235.96 1270.64 1278.20 1314.99 1325.79 1335.36 1336.25 1348.66 1352.15 1378.85 1383.81 1415.89 1426.74 1445.39 1447.53 1447.75 1455.25 1455.74 1456.21 1461.11 1462.49 1481.34 1483.23 1487.20 1488.51 1496.10 1512.29 1525.25 1531.35 1538.81 1597.21 1622.53 1670.01 3039.46 3045.27 3053.43 3072.89 3073.49 3073.61 3092.88 3107.96 3108.45 3149.95 3162.97 3163.52 3163.54 3164.21 3169.40 3169.82 3169.91 3170.01 3174.30 3183.76 3220.11 3220.52 3236.37 3251.07 3251.80 3260.84
frequency: 4.25 15.94 32.61 41.23 50.51 61.38 80.77 94.21 120.36 146.27 154.40 170.56 182.31 185.55 187.85 201.48 219.37 220.75 225.26 233.14 254.39 259.34 266.35 288.01 309.14 364.66 402.33 430.80 442.24 451.34 490.26 514.44 523.71 554.60 592.51 653.75 676.43 705.66 736.70 761.38 776.42 776.67 788.38 806.46 830.35 851.85 865.36 871.92 872.96 895.36 909.51 950.05 971.93 972.45 980.87 981.29 986.26 994.96 1002.06 1014.52 1026.51 1046.19 1092.45 1098.59 1117.70 1146.30 1148.08 1157.49 1173.29 1182.93 1211.27 1227.25 1235.96 1270.64 1278.20 1314.99 1325.79 1335.36 1336.25 1348.66 1352.15 1378.85 1383.81 1415.89 1426.74 1445.39 1447.53 1447.75 1455.25 1455.74 1456.21 1461.11 1462.49 1481.34 1483.23 1487.20 1488.51 1496.10 1512.29 1525.25 1531.35 1538.81 1597.21 1622.53 1670.01 3039.46 3045.27 3053.43 3072.89 3073.49 3073.61 3092.88 3107.96 3108.45 3149.95 3162.97 3163.52 3163.54 3164.21 3169.40 3169.82 3169.91 3170.01 3174.30 3183.76 3220.11 3220.52 3236.37 3251.07 3251.80 3260.84
formula: C17H26AuNP
InChI: InChI=1/C14H17N.C3H9P.Au/c1-15(2)13-7-5-11(6-8-13)14-9-3-4-12(14)10-14;1-4(2)3;/h5-8,12H,3,9-10H2,1-2H3;1-3H3;/rC17H26AuNP/c1-19(2)14-8-6-13(7-9-14)17-11-10-16(15(17)12-17)18-20(3,4)5/h6-9,15H,10-12H2,1-5H3
46 atoms
C  -1.211244 2.380192 -0.289335
H  -2.109278 2.114792 -0.845201
H  -0.912971 3.381293 -0.6287
C  -0.068386 1.436958 -0.560758
C  0.882023 1.47023 0.419648
H  1.658273 0.724637 0.529616
C  0.993585 2.686309 1.376846
H  1.918405 2.648908 1.938016
H  0.787293 3.638589 0.898541
C  -0.130348 1.92895 1.8574
C  -1.447758 2.317686 1.224291
H  -2.217943 1.58192 1.448056
H  -1.764772 3.273663 1.652244
Au -0.012623 0.173876 -2.171095
P  0.044488 -1.243469 -3.998317
C  0.788571 -0.497128 -5.471203
C  0.99382 -2.75945 -3.71556
C  -1.587945 -1.810871 -4.539194
H  -2.201824 -0.949003 -4.807572
H  -1.490024 -2.471702 -5.403672
H  -2.074442 -2.348773 -3.723305
H  0.218346 0.388618 -5.757543
H  0.78837 -1.213023 -6.296549
H  1.814604 -0.198209 -5.248631
H  2.022818 -2.500645 -3.458974
H  0.988002 -3.381773 -4.613502
H  0.553637 -3.314767 -2.885199
C  -0.051998 1.029115 3.005024
C  -0.962502 -0.025785 3.162656
C  0.927856 1.185246 3.994855
C  -0.900406 -0.884932 4.23733
H  -1.726515 -0.196373 2.412573
C  1.000183 0.34411 5.085171
H  1.636584 2.002987 3.930472
C  0.092499 -0.730341 5.234673
H  -1.622337 -1.68688 4.305603
H  1.760763 0.524807 5.832079
N  0.169529 -1.582128 6.293088
C  -0.87143 -2.575514 6.503215
C  1.113957 -1.322833 7.367567
H  -0.627075 -3.157412 7.389685
H  -1.853986 -2.112465 6.651918
H  -0.936624 -3.263537 5.655912
H  1.050668 -2.131775 8.092786
H  2.139185 -1.288659 6.989655
H  0.900863 -0.377772 7.881236
totalener: -1195.78012893113055 hartree
nucrepener: 1771.21396966004249 hartree
electener: -2966.91922390782975 hartree
oneelecener: -5182.37846512493888 hartree
twoeener: 2215.45924121710914 hartree
cpcmener: -0.06616436757352 hartree
kineticenergy: 1101.04449422781590 hartree
exchangeener: -93.211151178421 hartree
dispersion: -0.115562804 hartree
temp: 298.15 k
press: 1.00 atm
thermalcorrenthalpy: 0.00094421 hartree
totalenthalpy: -1195.47838076 hartree
vibrat: 0.03315145 hartree
rotat: 0.01708722 hartree
transl: 0.02107005 hartree
total: 0.07130872 hartree
totalentropycorr: -0.07130872 hartree
gibbsenthalpy: -1195.54968948 hartree
gibbsminuselec: 0.34600226 hartree
dispersion: -0.116607161 hartree
dispersion: -0.116595736 hartree
dispersion: -0.116601465 hartree
dispersion: -0.116595366 hartree
dispersion: -0.116584975 hartree
dispersion: -0.116589348 hartree
dispersion: -0.116590773 hartree
dispersion: -0.116609313 hartree
dispersion: -0.116593366 hartree
dispersion: -0.116595373 hartree
dispersion: -0.116596351 hartree
elementType: C H Au P N
energy: -2098.3937 -393.0635 -281.8948 -281.2377 -280.8424 -280.5572 -280.5389 -280.2744 -280.2704 -280.0968 -280.0818 -280.0624 -280.0205 -279.9489 -279.7600 -279.7580 -279.7572 -279.6956 -279.6814 -182.1815 -131.9194 -131.9192 -131.8754 -116.6365 -67.3789 -66.9067 -66.8645 -30.0013 -28.8334 -27.2492 -25.2999 -25.2196 -24.7317 -24.4755 -23.6917 -23.3673 -22.9119 -22.9108 -22.0616 -21.2417 -20.1423 -19.8417 -18.8974 -18.7527 -18.4404 -17.9070 -17.2006 -16.7129 -16.3920 -16.0767 -15.8750 -15.5878 -15.3604 -15.2050 -15.2020 -14.9698 -14.9406 -14.5187 -14.4474 -14.3504 -14.3449 -14.1590 -14.1230 -14.0450 -13.8504 -13.7221 -13.5897 -13.3309 -13.2744 -12.8078 -12.7289 -12.6090 -12.5080 -12.0584 -11.9348 -11.5145 -11.5032 -11.4873 -11.4127 -10.3014 -10.1170 -10.0090 -9.7835 -7.9113 -0.7602 1.2156 1.3624 1.4969 2.1705 2.3576 2.8851 3.1327 3.2977 3.6248 3.7341 electronvolt
chargesum: 1.0000000
charge: -0.184352 0.146370 0.158564 -0.179696 -0.110681 0.146775 -0.183538 0.161227 0.145398 0.280501 -0.292206 0.139877 0.143430 0.055480 0.652617 -0.587968 -0.592733 -0.592664 0.175529 0.165348 0.175556 0.175994 0.165378 0.175919 0.175451 0.165458 0.175520 0.333107 -0.310792 -0.346751 -0.280020 0.133506 -0.256393 0.128952 0.339859 0.132375 0.133068 -0.136422 -0.302060 -0.301712 0.157772 0.138412 0.142222 0.157540 0.142648 0.138131
charge: -0.209017 0.139487 0.154819 -0.271809 -0.127619 0.151029 -0.106388 0.149257 0.149678 -0.029406 -0.154456 0.141353 0.147859 0.248903 0.631353 -0.436939 -0.437220 -0.437315 0.124872 0.119667 0.124805 0.124949 0.119680 0.124936 0.124914 0.119643 0.124810 -0.142903 -0.079992 -0.079881 -0.126682 0.149623 -0.128258 0.150179 -0.135516 0.146728 0.146736 0.063899 -0.231341 -0.231440 0.119046 0.111074 0.113342 0.118925 0.113777 0.110838
qa: -0.1844 0.1464 0.1586 -0.1797 -0.1107 0.1468 -0.1835 0.1612 0.1454 0.2805 -0.2922 0.1399 0.1434 0.0555 0.6526 -0.5880 -0.5927 -0.5927 0.1755 0.1653 0.1756 0.1760 0.1654 0.1759 0.1755 0.1655 0.1755 0.3331 -0.3108 -0.3468 -0.2800 0.1335 -0.2564 0.1290 0.3399 0.1324 0.1331 -0.1364 -0.3021 -0.3017 0.1578 0.1384 0.1422 0.1575 0.1426 0.1381
va: 3.8728 0.9542 0.9640 3.6862 3.8964 0.9505 3.9735 0.9679 0.9555 3.6629 4.0223 0.9691 0.9670 1.6684 4.0245 3.8408 3.8407 3.8402 0.9553 0.9580 0.9550 0.9547 0.9579 0.9548 0.9555 0.9579 0.9552 3.5566 3.9848 4.0112 3.8982 0.9707 3.8693 0.9735 3.9295 0.9766 0.9764 3.2523 3.8811 3.8817 0.9600 0.9548 0.9506 0.9597 0.9510 0.9545
dispersion: -0.116596902 hartree
energy: -1195.897637404049 hartree
dipole: -0.790527302 0.808255488 0.017728186 -31.100619749 30.653429528 -0.447190220 324.692688235 -324.367715468 0.324972767
dipolemethod: SCF
magnitude: 0.553082888 au
magnitude: 1.405824978 debye
zeropoint: 0.39515285 hartree
thermalvibcorrection: 0.02061202 hartree
thermalrotcorrection: 0.00141627 hartree
thermaltrasncorrection: 0.00141627 hartree
thermaltotal: -1195.47903999 hartree
thermalcorr: 0.02344456 hartree
nonthermalcorr: 0.39515285 hartree
totalcorr: 0.41859741 hartree
totalenthalpy: -1195.47809578 hartree
vibrat: 0.03811908 hartree
rotat: 0.01707251 hartree
total: 0.07626164 hartree
