program: Orca
programVersion: 6.1.x
elementType: C H H C C H C H H C C H H Au P C C C H H H H H H H H H C C C C H C H C H H N C C H H C H H C H H H H
elementType: Au
keywords: optts freq wb97x-d3bj def2-tzvp(-f) def2/J tightopt verytightscf
charge: 1
multiplicity: 1
frequency: 0.00 0.00 0.00 0.00 0.00 0.00 -23.28 8.48 13.34 18.60 34.51 45.33 77.54 97.76 100.31 119.21 129.35 150.37 161.47 169.29 182.95 189.52 196.24 219.67 222.81 235.16 249.59 254.75 258.99 261.02 270.65 358.09 364.85 416.64 428.06 430.71 451.52 466.28 506.45 554.11 586.24 626.93 653.47 693.73 704.71 708.83 754.86 776.50 778.53 779.87 793.21 808.91 833.47 842.07 857.55 872.79 874.13 883.23 890.48 895.21 914.97 944.66 947.70 952.26 973.53 973.96 974.57 980.50 985.90 988.30 995.69 1001.30 1004.05 1026.57 1038.16 1066.96 1073.73 1098.76 1130.05 1154.51 1160.40 1167.24 1193.27 1218.40 1227.26 1232.13 1238.76 1251.56 1264.25 1272.84 1290.52 1305.93 1326.34 1336.97 1337.58 1339.60 1350.23 1359.61 1363.44 1365.50 1377.91 1392.27 1397.54 1416.02 1435.33 1444.62 1447.76 1447.98 1454.86 1455.19 1458.58 1461.80 1478.16 1487.82 1488.81 1497.61 1513.79 1518.88 1527.79 1587.42 1634.43 1695.09 3019.74 3034.55 3046.91 3073.50 3074.13 3074.45 3077.91 3080.04 3093.20 3098.36 3100.64 3131.75 3140.11 3146.85 3151.50 3164.13 3164.64 3165.35 3170.60 3170.74 3171.26 3175.99 3198.99 3211.86 3234.08 3235.62 3264.06 3275.83
frequency: 8.48 13.34 18.60 34.51 45.33 77.54 97.76 100.31 119.21 129.35 150.37 161.47 169.29 182.95 189.52 196.24 219.67 222.81 235.16 249.59 254.75 258.99 261.02 270.65 358.09 364.85 416.64 428.06 430.71 451.52 466.28 506.45 554.11 586.24 626.93 653.47 693.73 704.71 708.83 754.86 776.50 778.53 779.87 793.21 808.91 833.47 842.07 857.55 872.79 874.13 883.23 890.48 895.21 914.97 944.66 947.70 952.26 973.53 973.96 974.57 980.50 985.90 988.30 995.69 1001.30 1004.05 1026.57 1038.16 1066.96 1073.73 1098.76 1130.05 1154.51 1160.40 1167.24 1193.27 1218.40 1227.26 1232.13 1238.76 1251.56 1264.25 1272.84 1290.52 1305.93 1326.34 1336.97 1337.58 1339.60 1350.23 1359.61 1363.44 1365.50 1377.91 1392.27 1397.54 1416.02 1435.33 1444.62 1447.76 1447.98 1454.86 1455.19 1458.58 1461.80 1478.16 1487.82 1488.81 1497.61 1513.79 1518.88 1527.79 1587.42 1634.43 1695.09 3019.74 3034.55 3046.91 3073.50 3074.13 3074.45 3077.91 3080.04 3093.20 3098.36 3100.64 3131.75 3140.11 3146.85 3151.50 3164.13 3164.64 3165.35 3170.60 3170.74 3171.26 3175.99 3198.99 3211.86 3234.08 3235.62 3264.06 3275.83
formula: C19H28AuNP
InChI: InChI=1/C16H19N.C3H9P.Au/c1-2-11-17(10-1)15-7-5-13(6-8-15)16-9-3-4-14(16)12-16;1-4(2)3;/h5-8,14H,1-3,9-12H2;1-3H3;/rC19H28AuNP/c1-22(2,3)20-18-10-11-19(14-17(18)19)15-6-8-16(9-7-15)21-12-4-5-13-21/h6-9,17H,4-5,10-14H2,1-3H3
50 atoms
C  0.232466 2.260354 -0.936948
H  -0.673146 2.616636 -1.431553
H  1.058179 2.793872 -1.430481
C  0.44196 0.813743 -1.213861
C  0.941943 0.175633 -0.065531
H  0.967222 -0.897821 0.042276
C  2.181559 0.930761 0.549472
H  2.844855 0.232145 1.043509
H  2.651866 1.676624 -0.0794
C  0.873697 1.181757 1.140704
C  0.199436 2.431879 0.589829
H  -0.833359 2.475559 0.939991
H  0.712134 3.336459 0.921358
Au 0.037592 -0.085701 -2.991555
P  -0.416744 -1.098946 -5.027754
C  -1.600209 -0.180559 -6.043248
C  1.050308 -1.295761 -6.069356
C  -1.114552 -2.761387 -4.871704
H  -2.049469 -2.713034 -4.310266
H  -1.305408 -3.181888 -5.861807
H  -0.412487 -3.400757 -4.333376
H  -2.54564 -0.088466 -5.505415
H  -1.767846 -0.70193 -6.988516
H  -1.209165 0.818869 -6.242687
H  1.488435 -0.316334 -6.270071
H  0.777181 -1.77345 -7.013165
H  1.786008 -1.911569 -5.548785
C  0.527468 0.701852 2.51343
C  0.546864 1.613947 3.570167
C  0.181821 -0.614398 2.805305
C  0.23885 1.235417 4.865484
H  0.806576 2.650808 3.379316
C  -0.125944 -1.016322 4.097193
H  0.144168 -1.356484 2.015379
C  -0.106025 -0.098656 5.164445
H  0.255076 1.980538 5.650989
H  -0.385089 -2.052005 4.277408
N  -0.41973 -0.48011 6.436449
C  -0.792835 -1.843064 6.796179
C  -0.220662 0.374367 7.60425
H  -1.611025 -2.203727 6.166926
H  0.055499 -2.530754 6.675654
C  -1.201032 -1.715952 8.262276
H  0.742972 0.889367 7.553489
H  -1.007034 1.136829 7.669483
C  -0.287638 -0.602671 8.779274
H  -2.247271 -1.40384 8.327758
H  -1.086545 -2.654415 8.806492
H  0.70932 -1.004089 8.981732
H  -0.658045 -0.129099 9.689486
totalener: -1273.27028675578003 hartree
nucrepener: 2005.64247855641270 hartree
electener: -3278.83580454653156 hartree
oneelecener: -5752.78713270869866 hartree
twoeener: 2473.95132816216710 hartree
cpcmener: -0.06560335690523 hartree
kineticenergy: 1178.14741325092632 hartree
exchangeener: -100.644470435339 hartree
dispersion: -0.126029058 hartree
temp: 298.15 k
press: 1.00 atm
thermalcorrenthalpy: 0.00094421 hartree
totalenthalpy: -1272.94128166 hartree
vibrat: 0.03432971 hartree
rotat: 0.01740492 hartree
transl: 0.02114605 hartree
total: 0.07288067 hartree
totalentropycorr: -0.07288067 hartree
gibbsenthalpy: -1273.01416233 hartree
gibbsminuselec: 0.38215348 hartree
dispersion: -0.126614355 hartree
dispersion: -0.126835352 hartree
dispersion: -0.126773776 hartree
dispersion: -0.126764982 hartree
dispersion: -0.126756355 hartree
dispersion: -0.126863668 hartree
dispersion: -0.126918351 hartree
dispersion: -0.126936745 hartree
dispersion: -0.126887625 hartree
dispersion: -0.126885536 hartree
dispersion: -0.126872640 hartree
dispersion: -0.126871445 hartree
dispersion: -0.126866201 hartree
dispersion: -0.126861007 hartree
dispersion: -0.126851477 hartree
dispersion: -0.126842450 hartree
dispersion: -0.126829220 hartree
dispersion: -0.126818225 hartree
dispersion: -0.126803243 hartree
dispersion: -0.126794603 hartree
dispersion: -0.126779018 hartree
dispersion: -0.126773291 hartree
dispersion: -0.126755411 hartree
dispersion: -0.126752751 hartree
dispersion: -0.126734185 hartree
dispersion: -0.126733137 hartree
dispersion: -0.126716282 hartree
dispersion: -0.126713541 hartree
dispersion: -0.126695311 hartree
dispersion: -0.126702392 hartree
dispersion: -0.126690899 hartree
dispersion: -0.126695183 hartree
dispersion: -0.126688605 hartree
dispersion: -0.126691026 hartree
dispersion: -0.126685098 hartree
dispersion: -0.126685804 hartree
dispersion: -0.126681293 hartree
dispersion: -0.126681487 hartree
dispersion: -0.126679293 hartree
dispersion: -0.126678772 hartree
dispersion: -0.126675429 hartree
dispersion: -0.126673050 hartree
dispersion: -0.126673952 hartree
dispersion: -0.126678835 hartree
dispersion: -0.126686107 hartree
dispersion: -0.126693781 hartree
dispersion: -0.126700567 hartree
dispersion: -0.126706142 hartree
dispersion: -0.126712270 hartree
dispersion: -0.126720965 hartree
dispersion: -0.126731002 hartree
dispersion: -0.126742385 hartree
dispersion: -0.126752636 hartree
dispersion: -0.126760938 hartree
dispersion: -0.126766793 hartree
dispersion: -0.126770454 hartree
dispersion: -0.126771613 hartree
dispersion: -0.126770619 hartree
dispersion: -0.126770072 hartree
dispersion: -0.126769784 hartree
dispersion: -0.126767702 hartree
dispersion: -0.126763496 hartree
dispersion: -0.126756743 hartree
dispersion: -0.126749863 hartree
dispersion: -0.126744472 hartree
dispersion: -0.126741470 hartree
dispersion: -0.126741790 hartree
dispersion: -0.126746254 hartree
dispersion: -0.126753959 hartree
dispersion: -0.126764774 hartree
dispersion: -0.126778176 hartree
dispersion: -0.126792914 hartree
dispersion: -0.126805753 hartree
dispersion: -0.126813410 hartree
dispersion: -0.126815356 hartree
dispersion: -0.126806282 hartree
dispersion: -0.126808191 hartree
dispersion: -0.126800664 hartree
dispersion: -0.126809622 hartree
dispersion: -0.126806349 hartree
dispersion: -0.126816396 hartree
dispersion: -0.126813810 hartree
dispersion: -0.126817851 hartree
dispersion: -0.126801777 hartree
dispersion: -0.126809004 hartree
dispersion: -0.126798748 hartree
dispersion: -0.126791392 hartree
dispersion: -0.126787546 hartree
dispersion: -0.126785582 hartree
dispersion: -0.126785797 hartree
dispersion: -0.126793828 hartree
dispersion: -0.126802745 hartree
dispersion: -0.126812076 hartree
dispersion: -0.126805161 hartree
dispersion: -0.126796530 hartree
dispersion: -0.126794388 hartree
dispersion: -0.126798505 hartree
dispersion: -0.126800170 hartree
dispersion: -0.126799013 hartree
dispersion: -0.126798738 hartree
dispersion: -0.126798196 hartree
elementType: C H Au P N
energy: -2098.5088 -392.5392 -281.8744 -281.0490 -280.8500 -280.7839 -280.6529 -280.2608 -280.2597 -280.1573 -279.9288 -279.8337 -279.8290 -279.8278 -279.8233 -279.7746 -279.7621 -279.4974 -279.4780 -279.4420 -279.4371 -182.2986 -132.0358 -132.0354 -131.9941 -116.9297 -67.6883 -67.2054 -67.1321 -29.8667 -29.2101 -27.2002 -25.6642 -25.3786 -25.2188 -24.3053 -24.0833 -23.6044 -23.1557 -22.9858 -22.9828 -21.4115 -20.8251 -20.3880 -19.3914 -19.2540 -18.8918 -18.6824 -18.5948 -18.0743 -17.4584 -16.8604 -16.3561 -16.0434 -15.7849 -15.5144 -15.3302 -15.2763 -15.2723 -14.8296 -14.7120 -14.6424 -14.5673 -14.4850 -14.4273 -14.4160 -14.2578 -13.9700 -13.9165 -13.8709 -13.6329 -13.4087 -13.1917 -12.8793 -12.7777 -12.4827 -12.3461 -12.2638 -12.2416 -12.0723 -11.9361 -11.8218 -11.7593 -11.7427 -11.6386 -11.2386 -10.6680 -10.2909 -10.1128 -9.7420 -7.6579 -0.8839 1.1330 1.5233 1.6141 2.0355 2.2401 2.8721 2.9697 3.3285 3.6096 3.6913 electronvolt
chargesum: 1.0000000
charge: -0.207928 0.168574 0.181955 -0.086554 -0.121818 0.162579 -0.186160 0.158852 0.148732 0.254752 -0.279042 0.129913 0.136124 0.098492 0.653610 -0.592500 -0.586705 -0.590140 0.177638 0.167864 0.177027 0.177552 0.167587 0.177132 0.177339 0.167524 0.177353 0.284632 -0.358462 -0.295799 -0.267303 0.122592 -0.275049 0.118611 0.278955 0.131220 0.127809 -0.102886 -0.170413 -0.176759 0.122472 0.105818 -0.172653 0.119822 0.108210 -0.159969 0.104824 0.120432 0.103904 0.120238
charge: -0.204783 0.156316 0.171235 -0.167370 -0.133483 0.155226 -0.053659 0.149048 0.144355 -0.139555 -0.153155 0.140606 0.138664 0.286817 0.636145 -0.435179 -0.434719 -0.434902 0.125842 0.120950 0.125829 0.125843 0.120793 0.125743 0.125830 0.121026 0.125869 -0.131076 -0.100901 -0.106028 -0.132250 0.147441 -0.135086 0.145360 -0.157208 0.143503 0.142897 0.095920 -0.199476 -0.196682 0.122816 0.118632 -0.222370 0.122639 0.118544 -0.221647 0.127436 0.125468 0.127393 0.125342
qa: -0.2079 0.1686 0.1820 -0.0866 -0.1218 0.1626 -0.1862 0.1589 0.1487 0.2548 -0.2790 0.1299 0.1361 0.0985 0.6536 -0.5925 -0.5867 -0.5901 0.1776 0.1679 0.1770 0.1776 0.1676 0.1771 0.1773 0.1675 0.1774 0.2846 -0.3585 -0.2958 -0.2673 0.1226 -0.2750 0.1186 0.2790 0.1312 0.1278 -0.1029 -0.1704 -0.1768 0.1225 0.1058 -0.1727 0.1198 0.1082 -0.1600 0.1048 0.1204 0.1039 0.1202
va: 3.9128 0.9540 0.9574 3.5002 3.8890 0.9473 4.0018 0.9658 0.9596 3.6571 4.0148 0.9688 0.9656 1.6990 4.0291 3.8408 3.8447 3.8423 0.9543 0.9575 0.9549 0.9545 0.9576 0.9548 0.9545 0.9574 0.9547 3.5870 3.9522 3.9180 3.8215 0.9690 3.8661 0.9731 4.0241 0.9727 0.9756 3.2159 3.9666 3.9691 0.9486 0.9528 3.9412 0.9509 0.9499 3.9322 0.9699 0.9670 0.9701 0.9668
dispersion: -0.126797925 hartree
energy: -1273.393648398570 hartree
dipole: -5.529860414 5.805604767 0.275744354 -4.980396646 4.823474753 -0.156921893 434.631652900 -437.461561322 -2.829908422
dipolemethod: SCF
magnitude: 2.847637812 au
magnitude: 7.238120095 debye
zeropoint: 0.43206075 hartree
thermalvibcorrection: 0.02097054 hartree
thermalrotcorrection: 0.00141627 hartree
thermaltrasncorrection: 0.00141627 hartree
thermaltotal: -1272.93778457 hartree
thermalcorr: 0.02380308 hartree
nonthermalcorr: 0.43206075 hartree
totalcorr: 0.45586383 hartree
totalenthalpy: -1272.93684036 hartree
vibrat: 0.03863518 hartree
rotat: 0.01734693 hartree
total: 0.07712816 hartree
