program: Orca
programVersion: 6.1.x
elementType: C H H C C H C H H C C H H Au P C C C H H H H H H H H H C C C C H C H C H H O H
elementType: Au
keywords: optts freq wb97x-d3bj def2-tzvp(-f) def2/J tightopt verytightscf
charge: 1
multiplicity: 1
frequency: 0.00 0.00 0.00 0.00 0.00 0.00 -254.12 5.67 17.38 31.86 44.22 52.10 90.15 123.17 142.70 163.74 183.98 185.45 198.57 219.53 221.51 223.09 228.89 251.93 259.17 262.20 326.98 364.56 388.67 408.90 417.52 436.79 457.40 490.46 513.71 553.38 591.13 655.94 696.15 705.61 747.44 755.18 775.35 775.95 806.40 837.89 851.82 856.75 862.22 869.40 871.68 872.70 900.45 941.11 971.60 972.39 978.47 980.39 993.93 1006.77 1012.29 1037.03 1053.22 1098.43 1115.81 1153.17 1172.27 1178.83 1206.88 1216.13 1217.79 1264.79 1310.89 1318.85 1334.74 1335.78 1337.67 1347.95 1348.57 1383.36 1386.23 1427.50 1445.44 1447.89 1448.34 1455.33 1456.05 1461.61 1461.91 1476.25 1495.08 1530.06 1568.24 1582.59 1657.54 1673.64 3054.28 3072.21 3072.79 3072.96 3076.80 3147.05 3148.85 3162.29 3162.76 3163.42 3168.56 3168.68 3168.92 3176.03 3210.07 3224.92 3225.77 3238.48 3243.78 3250.62 3767.92
frequency: 5.67 17.38 31.86 44.22 52.10 90.15 123.17 142.70 163.74 183.98 185.45 198.57 219.53 221.51 223.09 228.89 251.93 259.17 262.20 326.98 364.56 388.67 408.90 417.52 436.79 457.40 490.46 513.71 553.38 591.13 655.94 696.15 705.61 747.44 755.18 775.35 775.95 806.40 837.89 851.82 856.75 862.22 869.40 871.68 872.70 900.45 941.11 971.60 972.39 978.47 980.39 993.93 1006.77 1012.29 1037.03 1053.22 1098.43 1115.81 1153.17 1172.27 1178.83 1206.88 1216.13 1217.79 1264.79 1310.89 1318.85 1334.74 1335.78 1337.67 1347.95 1348.57 1383.36 1386.23 1427.50 1445.44 1447.89 1448.34 1455.33 1456.05 1461.61 1461.91 1476.25 1495.08 1530.06 1568.24 1582.59 1657.54 1673.64 3054.28 3072.21 3072.79 3072.96 3076.80 3147.05 3148.85 3162.29 3162.76 3163.42 3168.56 3168.68 3168.92 3176.03 3210.07 3224.92 3225.77 3238.48 3243.78 3250.62 3767.92
formula: C15H21AuOP
InChI: InChI=1/C12H12O.C3H9P.Au/c13-12-8-6-11(7-9-12)10-4-2-1-3-5-10;1-4(2)3;/h2,6-9,13H,3-5H2;1-3H3;/rC15H21AuOP/c1-18(2,3)16-14-8-4-12(5-9-14)13-6-10-15(17)11-7-13/h6-8,10-11,17H,4-5,9H2,1-3H3
39 atoms
C  -2.054096 -1.24614 0.528075
H  -1.815604 -2.150019 -0.030708
H  -3.103939 -1.009814 0.310089
C  -1.21105 -0.066854 0.100082
C  -1.182397 0.93785 1.005582
H  -0.488839 1.769158 0.980102
C  -2.206104 0.963285 2.175605
H  -2.134138 1.892044 2.72793
H  -3.215364 0.730726 1.84415
C  -1.426233 -0.155091 2.644732
C  -1.809154 -1.467189 2.026923
H  -1.037414 -2.219089 2.17489
H  -2.70769 -1.811875 2.552628
Au -0.205396 -0.021677 -1.689357
P  0.913125 0.025541 -3.710715
C  0.05514 0.9732 -4.994417
C  2.56439 0.764623 -3.617019
C  1.179714 -1.608717 -4.44509
H  0.216024 -2.093116 -4.613841
H  1.710671 -1.513827 -5.395229
H  1.766703 -2.22359 -3.760185
H  -0.929199 0.535784 -5.172044
H  0.631813 0.960948 -5.92233
H  -0.074116 2.004278 -4.659926
H  2.481964 1.794074 -3.263122
H  3.038852 0.754765 -4.60115
H  3.176703 0.198814 -2.912321
C  -0.410654 -0.032702 3.673503
C  0.639793 -0.961901 3.775886
C  -0.465442 1.011826 4.610189
C  1.595172 -0.852286 4.762309
H  0.728305 -1.764935 3.055117
C  0.477261 1.123654 5.611373
H  -1.273021 1.732083 4.575743
C  1.514481 0.191549 5.688125
H  2.411993 -1.561182 4.831114
H  0.414897 1.925331 6.340177
O  2.467369 0.253329 6.641639
H  2.305836 1.018022 7.214508
totalener: -1136.97410177673419 hartree
nucrepener: 1510.89218268457580 hartree
electener: -2647.78691184132686 hartree
oneelecener: -4587.66249779429927 hartree
twoeener: 1939.87558595297241 hartree
cpcmener: -0.07213967070696 hartree
kineticenergy: 1042.69589312037897 hartree
exchangeener: -86.506844863481 hartree
dispersion: -0.102834736 hartree
temp: 298.15 k
press: 1.00 atm
thermalcorrenthalpy: 0.00094421 hartree
totalenthalpy: -1136.73171021 hartree
vibrat: 0.02793052 hartree
rotat: 0.01672809 hartree
transl: 0.02098647 hartree
total: 0.06564508 hartree
totalentropycorr: -0.06564508 hartree
gibbsenthalpy: -1136.79735529 hartree
gibbsminuselec: 0.27958122 hartree
dispersion: -0.102887713 hartree
dispersion: -0.103221678 hartree
dispersion: -0.103231429 hartree
dispersion: -0.103213013 hartree
dispersion: -0.103227113 hartree
dispersion: -0.103228603 hartree
dispersion: -0.103231862 hartree
dispersion: -0.103233429 hartree
dispersion: -0.103233194 hartree
dispersion: -0.103233988 hartree
dispersion: -0.103234102 hartree
elementType: C H Au P O
energy: -2098.3609 -524.3658 -282.3444 -282.1850 -280.5532 -280.5188 -280.4853 -280.4719 -280.4489 -280.4205 -280.1926 -280.1136 -280.0477 -279.9601 -279.7418 -279.7395 -279.7390 -182.1474 -131.8858 -131.8855 -131.8406 -116.5414 -67.2776 -66.8093 -66.7795 -33.2994 -28.7153 -27.6503 -25.3428 -25.2593 -24.9481 -24.6663 -23.7221 -22.8925 -22.8898 -21.5191 -21.3375 -20.5268 -19.2730 -18.7990 -18.7169 -18.3299 -17.5226 -16.8706 -16.5032 -15.9871 -15.6925 -15.4733 -15.2726 -15.2275 -15.1848 -15.1827 -14.8459 -14.4770 -14.3834 -14.3304 -14.3109 -14.2101 -13.8580 -13.8327 -13.4702 -13.0842 -12.8711 -12.8650 -12.7182 -12.6040 -12.2432 -11.9245 -11.4393 -11.4109 -11.3940 -10.4466 -10.3261 -10.0795 -9.8654 -8.9053 -1.0156 1.0799 1.1990 1.2825 2.1775 2.3490 2.7870 3.0723 3.2043 3.4883 3.6872 electronvolt
chargesum: 1.0000000
charge: -0.170778 0.146466 0.154194 -0.217381 -0.122394 0.146882 -0.202997 0.162425 0.145837 0.337808 -0.295670 0.143137 0.156091 0.043792 0.649140 -0.587280 -0.591113 -0.593107 0.175112 0.164547 0.174890 0.175389 0.164432 0.175169 0.174872 0.164594 0.175000 0.317535 -0.277754 -0.306862 -0.214701 0.145634 -0.197660 0.143026 0.379712 0.128431 0.141372 -0.442692 0.334905
charge: -0.210016 0.139537 0.152034 -0.317967 -0.135018 0.147388 -0.125962 0.148442 0.152381 0.029532 -0.155839 0.143723 0.158879 0.235005 0.629257 -0.437860 -0.437846 -0.437954 0.124575 0.119219 0.124449 0.124616 0.119209 0.124570 0.124589 0.119250 0.124467 -0.127750 -0.055411 -0.053954 -0.105583 0.153592 -0.115309 0.154722 -0.172769 0.150859 0.151573 0.032854 0.204514
qa: -0.1708 0.1465 0.1542 -0.2174 -0.1224 0.1469 -0.2030 0.1624 0.1458 0.3378 -0.2957 0.1431 0.1561 0.0438 0.6491 -0.5873 -0.5911 -0.5931 0.1751 0.1645 0.1749 0.1754 0.1644 0.1752 0.1749 0.1646 0.1750 0.3175 -0.2778 -0.3069 -0.2147 0.1456 -0.1977 0.1430 0.3797 0.1284 0.1414 -0.4427 0.3349
va: 3.8774 0.9529 0.9647 3.7230 3.8862 0.9521 3.9479 0.9656 0.9562 3.6010 4.0106 0.9674 0.9642 1.6574 4.0262 3.8401 3.8400 3.8386 0.9553 0.9582 0.9552 0.9548 0.9581 0.9551 0.9556 0.9582 0.9552 3.5963 4.0039 4.0110 3.9246 0.9668 3.8314 0.9707 3.9778 0.9824 0.9692 2.1063 0.9036
dispersion: -0.103234541 hartree
energy: -1137.078437724282 hartree
dipole: 30.986303976 -31.326793158 -0.340489182 0.624622270 -0.119652952 0.504969318 234.997847823 -233.969237931 1.028609892
dipolemethod: SCF
magnitude: 1.195393326 au
magnitude: 3.038448366 debye
zeropoint: 0.32563156 hartree
thermalvibcorrection: 0.01733676 hartree
thermalrotcorrection: 0.00141627 hartree
thermaltrasncorrection: 0.00141627 hartree
thermaltotal: -1136.73263687 hartree
thermalcorr: 0.02016930 hartree
nonthermalcorr: 0.32563156 hartree
totalcorr: 0.34580086 hartree
totalenthalpy: -1136.73169266 hartree
vibrat: 0.03174747 hartree
rotat: 0.01670707 hartree
total: 0.06944100 hartree
