program: Orca
programVersion: 6.1.x
elementType: C H H C C H C H H C C H H Au P C C C H H H H H H H H H C C C C H C H C H H C C H H H
elementType: Au
keywords: optts freq wb97x-d3bj def2-tzvp(-f) def2/J tightopt verytightscf
charge: 1
multiplicity: 1
frequency: 0.00 0.00 0.00 0.00 0.00 0.00 -29.14 -9.12 26.78 31.88 44.70 59.10 80.91 92.75 113.47 143.09 150.38 163.93 183.56 192.82 202.28 213.16 221.91 224.11 242.79 257.22 259.18 275.70 342.97 362.45 397.43 403.87 423.00 445.79 489.58 508.40 578.99 591.12 639.69 649.36 655.55 703.94 706.37 773.06 773.39 783.04 803.47 805.75 812.85 850.38 871.08 871.36 885.60 895.24 928.15 959.49 970.86 971.22 979.83 984.14 1015.01 1016.05 1024.23 1027.46 1035.32 1045.54 1054.65 1064.35 1088.76 1136.26 1166.39 1194.16 1215.41 1243.98 1266.22 1290.69 1304.79 1310.83 1334.60 1335.06 1335.39 1347.83 1349.42 1368.49 1371.22 1381.00 1399.02 1424.02 1446.14 1448.78 1449.03 1456.10 1456.25 1462.33 1469.63 1476.75 1480.63 1487.73 1569.04 1613.03 1664.46 1695.05 1722.82 3002.71 3003.10 3052.91 3070.97 3071.47 3071.59 3124.49 3127.32 3160.54 3160.75 3161.38 3166.78 3167.02 3167.42 3169.74 3178.08 3179.24 3197.29 3222.11 3239.06 3255.33 3257.45 3267.55
frequency: 26.78 31.88 44.70 59.10 80.91 92.75 113.47 143.09 150.38 163.93 183.56 192.82 202.28 213.16 221.91 224.11 242.79 257.22 259.18 275.70 342.97 362.45 397.43 403.87 423.00 445.79 489.58 508.40 578.99 591.12 639.69 649.36 655.55 703.94 706.37 773.06 773.39 783.04 803.47 805.75 812.85 850.38 871.08 871.36 885.60 895.24 928.15 959.49 970.86 971.22 979.83 984.14 1015.01 1016.05 1024.23 1027.46 1035.32 1045.54 1054.65 1064.35 1088.76 1136.26 1166.39 1194.16 1215.41 1243.98 1266.22 1290.69 1304.79 1310.83 1334.60 1335.06 1335.39 1347.83 1349.42 1368.49 1371.22 1381.00 1399.02 1424.02 1446.14 1448.78 1449.03 1456.10 1456.25 1462.33 1469.63 1476.75 1480.63 1487.73 1569.04 1613.03 1664.46 1695.05 1722.82 3002.71 3003.10 3052.91 3070.97 3071.47 3071.59 3124.49 3127.32 3160.54 3160.75 3161.38 3166.78 3167.02 3167.42 3169.74 3178.08 3179.24 3197.29 3222.11 3239.06 3255.33 3257.45 3267.55
formula: C17H23AuP
InChI: InChI=1/C14H14.C3H9P.Au/c1-2-12-8-10-14(11-9-12)13-6-4-3-5-7-13;1-4(2)3;/h2,4,8-11H,1,5-7H2;1-3H3;/rC17H23AuP/c1-5-14-6-8-15(9-7-14)16-10-12-17(13-11-16)18-19(2,3)4/h5-9,12H,1,10-11,13H2,2-4H3
42 atoms
C  -0.351994 -1.257442 0.247846
H  0.030252 -2.10741 -0.318766
H  -1.425425 -1.436331 0.387752
C  -0.144203 0.045747 -0.497378
C  -0.144391 1.148595 0.258272
H  -0.011128 2.137075 -0.172254
C  -0.39317 1.141357 1.747886
H  0.066848 2.004977 2.232355
H  -1.472901 1.250119 1.950634
C  -0.006279 -0.101971 2.459882
C  0.343963 -1.257573 1.612558
H  1.427657 -1.125341 1.445335
H  0.218617 -2.20621 2.129612
Au 0.11009 0.058243 -2.541521
P  0.403115 0.06033 -4.832505
C  0.310005 1.701804 -5.597152
C  2.004152 -0.595866 -5.375242
C  -0.81721 -0.927225 -5.740042
H  -1.818563 -0.540814 -5.540072
H  -0.61891 -0.884925 -6.813695
H  -0.768914 -1.964373 -5.402406
H  -0.669239 2.141076 -5.396883
H  0.461379 1.627966 -6.676735
H  1.077581 2.347631 -5.166166
H  2.807392 0.004754 -4.943852
H  2.076648 -0.570727 -6.465186
H  2.112194 -1.625203 -5.027697
C  0.04127 -0.150605 3.874386
C  0.498098 -1.304735 4.554042
C  -0.357414 0.964918 4.65581
C  0.561959 -1.331182 5.926834
H  0.818772 -2.176882 4.001277
C  -0.312794 0.922734 6.025226
H  -0.716413 1.864832 4.174621
C  0.151222 -0.227117 6.688819
H  0.925402 -2.21754 6.434237
H  -0.631735 1.788417 6.591161
C  0.225954 -0.324148 8.153689
C  -0.189453 0.606946 9.010224
H  -0.631958 1.545001 8.692759
H  -0.097384 0.445668 10.078943
H  0.653707 -1.247534 8.533899
totalener: -1139.15906273917562 hartree
nucrepener: 1556.12198837787741 hartree
electener: -2695.19942828323155 hartree
oneelecener: -4677.64405265529422 hartree
twoeener: 1982.44462437206266 hartree
cpcmener: -0.07351720860439 hartree
kineticenergy: 1044.71196431651924 hartree
exchangeener: -88.077190545727 hartree
dispersion: -0.110283640 hartree
temp: 298.15 k
press: 1.00 atm
thermalcorrenthalpy: 0.00094421 hartree
totalenthalpy: -1138.89359708 hartree
vibrat: 0.03121292 hartree
rotat: 0.01690465 hartree
transl: 0.02101804 hartree
total: 0.06913562 hartree
totalentropycorr: -0.06913562 hartree
gibbsenthalpy: -1138.96273270 hartree
gibbsminuselec: 0.30661368 hartree
dispersion: -0.110374736 hartree
dispersion: -0.110448676 hartree
dispersion: -0.110496708 hartree
dispersion: -0.110539438 hartree
dispersion: -0.110586954 hartree
dispersion: -0.110633740 hartree
dispersion: -0.110676298 hartree
dispersion: -0.110716549 hartree
dispersion: -0.110761002 hartree
dispersion: -0.110813305 hartree
dispersion: -0.110822938 hartree
dispersion: -0.110850423 hartree
dispersion: -0.110868893 hartree
dispersion: -0.110881113 hartree
dispersion: -0.110899191 hartree
dispersion: -0.110919837 hartree
dispersion: -0.110932306 hartree
dispersion: -0.110941993 hartree
dispersion: -0.111004671 hartree
dispersion: -0.111053782 hartree
dispersion: -0.111105694 hartree
dispersion: -0.111139057 hartree
dispersion: -0.111080301 hartree
dispersion: -0.111075307 hartree
dispersion: -0.111061452 hartree
dispersion: -0.111047632 hartree
dispersion: -0.111051379 hartree
dispersion: -0.111041257 hartree
dispersion: -0.111044220 hartree
dispersion: -0.111038479 hartree
dispersion: -0.111035970 hartree
dispersion: -0.111033868 hartree
dispersion: -0.111036760 hartree
dispersion: -0.111037805 hartree
dispersion: -0.111036499 hartree
dispersion: -0.111031284 hartree
dispersion: -0.111034542 hartree
dispersion: -0.111019001 hartree
dispersion: -0.111006628 hartree
dispersion: -0.110990820 hartree
dispersion: -0.110975610 hartree
dispersion: -0.110985431 hartree
dispersion: -0.110983196 hartree
dispersion: -0.110996069 hartree
dispersion: -0.111008450 hartree
dispersion: -0.110995410 hartree
dispersion: -0.110997666 hartree
dispersion: -0.110985140 hartree
dispersion: -0.111007284 hartree
dispersion: -0.111083202 hartree
dispersion: -0.111054316 hartree
dispersion: -0.111038373 hartree
dispersion: -0.111028061 hartree
dispersion: -0.111018101 hartree
dispersion: -0.111007568 hartree
dispersion: -0.110981916 hartree
dispersion: -0.110973532 hartree
dispersion: -0.110959316 hartree
dispersion: -0.110953310 hartree
dispersion: -0.110983754 hartree
dispersion: -0.110976414 hartree
dispersion: -0.110988994 hartree
dispersion: -0.111013884 hartree
dispersion: -0.110999076 hartree
dispersion: -0.111002205 hartree
dispersion: -0.111000348 hartree
dispersion: -0.111002100 hartree
dispersion: -0.110987276 hartree
dispersion: -0.110978293 hartree
dispersion: -0.110991274 hartree
dispersion: -0.110990802 hartree
dispersion: -0.110989368 hartree
dispersion: -0.110990391 hartree
dispersion: -0.110990209 hartree
dispersion: -0.110990354 hartree
dispersion: -0.110990332 hartree
elementType: C H Au P
energy: -2098.1904 -282.7775 -281.2918 -280.9008 -280.8599 -280.8456 -280.3673 -280.3491 -280.3388 -280.3028 -280.2417 -280.1257 -279.7058 -279.6416 -279.6413 -279.6395 -279.3542 -279.2850 -181.9757 -131.7155 -131.7147 -131.6659 -116.2027 -66.9187 -66.4645 -66.4592 -28.6808 -27.6506 -26.1919 -25.2064 -25.1441 -24.9520 -24.5560 -23.6248 -22.7865 -22.7849 -21.6506 -21.4561 -20.5035 -19.6917 -19.2875 -18.5628 -18.1635 -17.3370 -16.8011 -16.6688 -16.4127 -15.9254 -15.6935 -15.5243 -15.2685 -15.0819 -15.0792 -14.9652 -14.7446 -14.5893 -14.3976 -14.2293 -14.2269 -13.9797 -13.7702 -13.7362 -13.5304 -13.1725 -12.8829 -12.7717 -12.5693 -12.5181 -12.1629 -11.9642 -11.6073 -11.1191 -11.1034 -11.0711 -10.5650 -9.8476 -9.7680 -9.1710 -9.0922 -2.0954 0.8882 1.1151 1.2779 1.4064 2.3520 2.7991 2.9625 3.2551 3.4375 3.5808 electronvolt
chargesum: 1.0000000
charge: -0.155881 0.140169 0.123022 -0.270728 -0.241117 0.119344 -0.150288 0.175343 0.186954 0.151477 -0.237457 0.186157 0.172055 -0.006672 0.643045 -0.594103 -0.589078 -0.591029 0.173516 0.161150 0.172857 0.173138 0.161342 0.173005 0.173157 0.161014 0.172738 0.348690 -0.221996 -0.208274 -0.284745 0.150026 -0.298640 0.156809 0.537448 0.137606 0.136530 -0.266905 -0.212477 0.150496 0.151633 0.140670
charge: -0.223404 0.134987 0.140131 -0.421960 -0.220190 0.132809 -0.164254 0.164827 0.187607 0.109367 -0.161787 0.188825 0.150940 0.192236 0.622580 -0.440879 -0.441440 -0.441197 0.123367 0.117494 0.123250 0.123392 0.117557 0.123353 0.123313 0.117430 0.123122 -0.116873 -0.016201 -0.021148 -0.080537 0.158055 -0.073538 0.159519 -0.060826 0.154821 0.153582 -0.143661 -0.118945 0.125775 0.128598 0.149903
qa: -0.1559 0.1402 0.1230 -0.2707 -0.2411 0.1193 -0.1503 0.1753 0.1870 0.1515 -0.2375 0.1862 0.1721 -0.0067 0.6430 -0.5941 -0.5891 -0.5910 0.1735 0.1612 0.1729 0.1731 0.1613 0.1730 0.1732 0.1610 0.1727 0.3487 -0.2220 -0.2083 -0.2847 0.1500 -0.2986 0.1568 0.5374 0.1376 0.1365 -0.2669 -0.2125 0.1505 0.1516 0.1407
va: 3.9390 0.9415 0.9655 3.7788 4.0340 0.9527 3.8257 0.9551 0.9506 3.6510 3.9406 0.9555 0.9516 1.6468 4.0055 3.8366 3.8373 3.8357 0.9552 0.9587 0.9556 0.9559 0.9588 0.9560 0.9553 0.9588 0.9556 3.5407 3.8312 3.8889 3.9075 0.9668 3.9337 0.9620 3.6392 0.9733 0.9758 3.9180 3.8939 0.9677 0.9689 0.9675
dispersion: -0.110990461 hartree
energy: -1139.270172753972 hartree
dipole: 2.344554682 -2.184694205 0.159860477 -9.387561793 9.067548523 -0.320013270 336.363047316 -332.444818779 3.918228537
dipolemethod: SCF
magnitude: 3.934523953 au
magnitude: 10.000765115 debye
zeropoint: 0.35429000 hartree
thermalvibcorrection: 0.01768746 hartree
thermalrotcorrection: 0.00141627 hartree
thermaltrasncorrection: 0.00141627 hartree
thermaltotal: -1138.89536275 hartree
thermalcorr: 0.02052000 hartree
nonthermalcorr: 0.35429000 hartree
totalcorr: 0.37481000 hartree
totalenthalpy: -1138.89441854 hartree
vibrat: 0.03138375 hartree
rotat: 0.01675824 hartree
total: 0.06916004 hartree
