program: Orca
programVersion: 6.1.x
elementType: Au C C C C H C H H C P C C H C H H H H H H H H H H H H C C C C H C H C F F F
elementType: Au
keywords: opt freq wb97x-d3bj def2-tzvp(-f) def2/J tightopt verytightscf
charge: 1
multiplicity: 1
frequency: 0.00 0.00 0.00 0.00 0.00 0.00 13.54 16.86 31.94 36.52 41.23 81.79 108.36 128.87 137.69 166.74 182.02 182.34 193.63 201.39 208.53 220.38 222.26 242.07 258.50 259.87 273.74 285.61 304.99 354.50 364.54 367.00 398.43 429.03 437.08 501.07 540.91 560.65 578.53 608.40 655.42 705.37 720.72 751.03 755.19 774.35 774.81 804.25 805.80 839.80 864.52 871.34 871.86 878.97 897.34 918.34 922.62 970.41 971.24 971.55 980.07 996.15 1027.87 1036.26 1075.90 1080.37 1127.85 1146.77 1161.80 1212.46 1253.54 1267.93 1276.94 1289.55 1328.59 1334.19 1334.89 1335.75 1348.21 1366.45 1378.30 1438.89 1445.30 1448.09 1448.36 1455.31 1455.69 1461.81 1465.76 1490.01 1532.42 1547.51 1595.69 1668.56 1671.44 1680.51 3072.08 3072.63 3072.84 3080.85 3116.62 3126.58 3137.30 3161.82 3162.33 3162.97 3168.29 3168.78 3168.97 3194.49 3203.42 3211.96 3272.52 3275.56
frequency: 13.54 16.86 31.94 36.52 41.23 81.79 108.36 128.87 137.69 166.74 182.02 182.34 193.63 201.39 208.53 220.38 222.26 242.07 258.50 259.87 273.74 285.61 304.99 354.50 364.54 367.00 398.43 429.03 437.08 501.07 540.91 560.65 578.53 608.40 655.42 705.37 720.72 751.03 755.19 774.35 774.81 804.25 805.80 839.80 864.52 871.34 871.86 878.97 897.34 918.34 922.62 970.41 971.24 971.55 980.07 996.15 1027.87 1036.26 1075.90 1080.37 1127.85 1146.77 1161.80 1212.46 1253.54 1267.93 1276.94 1289.55 1328.59 1334.19 1334.89 1335.75 1348.21 1366.45 1378.30 1438.89 1445.30 1448.09 1448.36 1455.31 1455.69 1461.81 1465.76 1490.01 1532.42 1547.51 1595.69 1668.56 1671.44 1680.51 3072.08 3072.63 3072.84 3080.85 3116.62 3126.58 3137.30 3161.82 3162.33 3162.97 3168.29 3168.78 3168.97 3194.49 3203.42 3211.96 3272.52 3275.56
formula: C15H18F3AuP
InChI: InChI=1/C12H9F3.C3H9P.Au/c13-10-6-9(7-11(14)12(10)15)8-4-2-1-3-5-8;1-4(2)3;/h2,6-7H,3-5H2;1-3H3;/rC15H18AuF3P/c1-20(2,3)16-12-6-4-10(5-7-12)11-8-13(17)15(19)14(18)9-11/h6,8-9H,4-5,7H2,1-3H3
38 atoms
Au -0.042704 -2.114638 0.180767
C  1.52301 0.30433 0.954201
C  0.32283 -0.267457 1.034438
C  0.627708 2.371884 1.63327
C  1.903537 1.664059 1.625612
H  2.253736 1.476853 2.641838
C  -0.810585 0.436554 1.71538
H  -1.319529 -0.211208 2.432001
H  -1.551873 0.736145 0.968447
C  -0.362099 1.735813 2.498666
P  -0.432337 -4.177267 -0.776965
C  0.680262 -4.568235 -2.152992
C  -0.248445 -5.569482 0.368666
H  2.347439 -0.12368 0.392755
C  -2.096229 -4.372167 -1.467978
H  -2.261633 -3.614815 -2.236693
H  -2.210361 -5.366427 -1.906392
H  -2.836543 -4.236606 -0.677143
H  0.567948 -3.815528 -2.935762
H  0.447492 -5.554741 -2.560874
H  1.713318 -4.555333 -1.800148
H  0.765685 -5.576306 0.772813
H  -0.441069 -6.513301 -0.14703
H  -0.95389 -5.455529 1.194001
H  2.690647 2.137099 1.047392
H  -1.235855 2.340054 2.723237
H  0.118174 1.410896 3.421436
C  0.298622 3.42302 0.712414
C  -1.018423 3.919446 0.654376
C  1.277165 3.946387 -0.155365
C  -1.332965 4.897727 -0.253859
H  -1.803039 3.554562 1.30193
C  0.931036 4.925204 -1.051036
H  2.302896 3.606539 -0.143353
C  -0.369851 5.412083 -1.113973
F  -2.575363 5.386556 -0.33583
F  -0.685916 6.360941 -1.979204
F  1.836579 5.442608 -1.88861
totalener: -1359.52218181411104 hartree
nucrepener: 1796.75557537238865 hartree
electener: -3156.19501888147852 hartree
oneelecener: -5467.50320110051507 hartree
twoeener: 2311.30818221903655 hartree
cpcmener: -0.07802251256260 hartree
kineticenergy: 1264.77668387087965 hartree
exchangeener: -101.694062691505 hartree
dispersion: -0.104020281 hartree
dispersion: -0.104192256 hartree
dispersion: -0.104228096 hartree
dispersion: -0.104175014 hartree
dispersion: -0.104156968 hartree
dispersion: -0.104172408 hartree
dispersion: -0.104175876 hartree
dispersion: -0.104187652 hartree
dispersion: -0.104213170 hartree
dispersion: -0.104208441 hartree
dispersion: -0.104191676 hartree
dispersion: -0.104193309 hartree
dispersion: -0.104190558 hartree
dispersion: -0.104185318 hartree
dispersion: -0.104179823 hartree
dispersion: -0.104173871 hartree
dispersion: -0.104167988 hartree
dispersion: -0.104167883 hartree
dispersion: -0.104164897 hartree
dispersion: -0.104170249 hartree
dispersion: -0.104209321 hartree
dispersion: -0.104191710 hartree
dispersion: -0.104184630 hartree
dispersion: -0.104184687 hartree
dispersion: -0.104185969 hartree
elementType: Au C H P F
energy: -2098.3031 -675.6792 -675.2379 -675.2337 -283.6899 -283.2413 -283.2401 -282.9478 -281.4749 -281.2446 -281.2363 -280.5174 -280.4566 -280.3282 -280.0412 -279.7154 -279.7072 -279.7056 -279.7047 -182.0874 -131.8261 -131.8258 -131.7801 -116.3709 -67.0962 -66.6347 -66.6295 -38.8003 -38.1563 -38.0297 -29.2086 -28.0616 -25.9387 -25.6951 -25.2227 -24.7619 -24.3534 -22.8554 -22.8548 -22.3691 -22.1837 -21.1315 -20.3625 -19.7926 -19.2718 -18.9261 -18.6440 -18.0638 -18.0216 -17.9063 -17.2143 -16.9190 -16.6199 -16.5558 -16.1385 -15.8886 -15.7156 -15.6219 -15.3760 -15.1501 -15.1482 -15.0127 -14.6036 -14.4260 -14.3067 -14.2930 -14.2228 -14.1534 -13.8123 -13.8006 -13.5873 -13.1921 -12.6581 -12.6092 -12.3354 -11.7607 -11.3304 -11.2685 -11.2586 -10.9205 -10.5932 -9.9597 -9.6094 -9.2611 -2.0901 0.9464 1.0646 1.3019 1.8712 2.2347 2.4558 2.5941 2.9547 3.5465 3.5889 electronvolt
chargesum: 1.0000000
charge: 0.027982 -0.209769 -0.246289 0.281133 -0.166891 0.160822 -0.189877 0.156624 0.154644 -0.228783 0.645071 -0.592987 -0.586196 0.141343 -0.591825 0.174173 0.163061 0.173791 0.174269 0.163472 0.174249 0.174358 0.162731 0.173970 0.161170 0.170485 0.170383 0.388450 -0.307718 -0.327485 0.285612 0.154407 0.292807 0.148287 0.254896 -0.234519 -0.211286 -0.234566
charge: 0.214282 -0.170961 -0.397197 0.099706 -0.148447 0.160782 -0.192439 0.144405 0.146844 -0.142141 0.626692 -0.439166 -0.439311 0.143069 -0.439251 0.123918 0.118524 0.123915 0.124016 0.118468 0.124039 0.123996 0.118424 0.123951 0.146915 0.147233 0.162065 -0.094700 0.002382 0.002898 -0.138115 0.170161 -0.137951 0.169233 -0.083890 0.117728 0.152144 0.117776
qa: 0.0280 -0.2098 -0.2463 0.2811 -0.1669 0.1608 -0.1899 0.1566 0.1546 -0.2288 0.6451 -0.5930 -0.5862 0.1413 -0.5918 0.1742 0.1631 0.1738 0.1743 0.1635 0.1742 0.1744 0.1627 0.1740 0.1612 0.1705 0.1704 0.3884 -0.3077 -0.3275 0.2856 0.1544 0.2928 0.1483 0.2549 -0.2345 -0.2113 -0.2346
va: 1.6443 3.9900 3.7921 3.7306 3.8631 0.9602 3.9570 0.9470 0.9470 3.9392 4.0282 3.8390 3.8385 0.9508 3.8374 0.9552 0.9585 0.9556 0.9552 0.9584 0.9554 0.9550 0.9585 0.9552 0.9545 0.9539 0.9538 3.4785 3.8548 3.8755 3.9485 0.9827 3.9426 0.9869 3.9580 1.0849 1.1308 1.0846
dispersion: -0.104185802 hartree
energy: -1359.628391174221 hartree
dipole: -2.935833420 3.231676969 0.295843549 268.648639741 -268.735405590 -0.086765849 -19.373946058 20.798077365 1.424131307
dipolemethod: SCF
magnitude: 1.457121031 au
magnitude: 3.703707322 debye
temp: 298.15 k
press: 1.00 atm
zeropoint: 0.29766348 hartree
thermalvibcorrection: 0.01927277 hartree
thermalrotcorrection: 0.00141627 hartree
thermaltrasncorrection: 0.00141627 hartree
thermaltotal: -1359.30862237 hartree
thermalcorr: 0.02210532 hartree
nonthermalcorr: 0.29766348 hartree
totalcorr: 0.31976880 hartree
thermalcorrenthalpy: 0.00094421 hartree
totalenthalpy: -1359.30767816 hartree
vibrat: 0.03505078 hartree
rotat: 0.01707521 hartree
transl: 0.02110237 hartree
total: 0.07322835 hartree
totalentropycorr: -0.07322835 hartree
gibbsenthalpy: -1359.38090652 hartree
gibbsminuselec: 0.24748466 hartree
