program: Orca
programVersion: 6.1.x
elementType: Au C C C C H C H H C P C C H C H H H H H H H H H H H H C C C C H C H C N O O C N C N
elementType: Au
keywords: opt freq wb97x-d3bj def2-tzvp(-f) def2/J tightopt verytightscf
charge: 1
multiplicity: 1
frequency: 0.00 0.00 0.00 0.00 0.00 0.00 -10.38 8.99 18.42 32.80 36.85 51.58 54.68 81.79 101.50 110.16 134.99 139.79 152.69 159.89 168.22 175.66 182.43 184.84 205.35 212.88 220.82 222.21 227.93 256.08 258.99 266.69 285.74 364.47 371.64 378.57 388.88 403.00 427.14 480.71 491.12 504.06 513.07 543.07 599.13 626.71 635.00 662.43 673.36 705.89 742.53 750.26 775.58 775.88 807.07 819.80 831.88 844.84 853.37 871.93 872.76 883.84 904.67 955.97 963.64 972.08 972.69 974.93 980.78 982.16 984.49 1023.82 1062.79 1090.63 1125.48 1159.45 1170.29 1184.41 1211.44 1255.32 1272.85 1281.45 1327.94 1334.16 1335.64 1336.57 1348.89 1350.80 1384.09 1426.36 1442.42 1444.89 1447.95 1448.44 1454.86 1455.43 1456.74 1461.77 1461.91 1479.48 1517.33 1543.84 1592.89 1649.81 1671.84 1691.85 2409.76 2411.23 3045.26 3053.74 3072.27 3072.90 3073.37 3114.51 3150.39 3162.11 3162.92 3163.87 3168.61 3168.88 3169.38 3170.70 3215.34 3231.19 3257.70 3264.14
frequency: 8.99 18.42 32.80 36.85 51.58 54.68 81.79 101.50 110.16 134.99 139.79 152.69 159.89 168.22 175.66 182.43 184.84 205.35 212.88 220.82 222.21 227.93 256.08 258.99 266.69 285.74 364.47 371.64 378.57 388.88 403.00 427.14 480.71 491.12 504.06 513.07 543.07 599.13 626.71 635.00 662.43 673.36 705.89 742.53 750.26 775.58 775.88 807.07 819.80 831.88 844.84 853.37 871.93 872.76 883.84 904.67 955.97 963.64 972.08 972.69 974.93 980.78 982.16 984.49 1023.82 1062.79 1090.63 1125.48 1159.45 1170.29 1184.41 1211.44 1255.32 1272.85 1281.45 1327.94 1334.16 1335.64 1336.57 1348.89 1350.80 1384.09 1426.36 1442.42 1444.89 1447.95 1448.44 1454.86 1455.43 1456.74 1461.77 1461.91 1479.48 1517.33 1543.84 1592.89 1649.81 1671.84 1691.85 2409.76 2411.23 3045.26 3053.74 3072.27 3072.90 3073.37 3114.51 3150.39 3162.11 3162.92 3163.87 3168.61 3168.88 3169.38 3170.70 3215.34 3231.19 3257.70 3264.14
formula: C17H18AuN3O2P
InChI: InChI=1/C14H9N3O2.C3H9P.Au/c15-8-12-6-11(10-4-2-1-3-5-10)7-13(9-16)14(12)17(18)19;1-4(2)3;/h2,6-7H,3-5H2;1-3H3;/rC17H18AuN3O2P/c1-24(2,3)18-16-6-4-12(5-7-16)13-8-14(10-19)17(21(22)23)15(9-13)11-20/h6,8-9H,4-5,7H2,1-3H3
42 atoms
Au -0.158068 -2.837629 0.174062
C  1.161322 -0.333124 1.194336
C  0.062166 -1.099123 1.254141
C  0.178311 1.506764 1.888911
C  1.343827 0.766653 2.278387
H  1.24451 0.317828 3.267726
C  -0.984188 -0.651248 2.25016
H  -0.691118 -1.052774 3.229551
H  -1.966855 -1.067471 2.031899
C  -1.105882 0.885802 2.275233
P  -0.410374 -4.786162 -1.038054
C  -0.95813 -4.517704 -2.743601
C  1.110307 -5.758566 -1.189908
H  1.937248 -0.37806 0.440009
C  -1.624089 -5.933758 -0.337694
H  -2.599745 -5.446394 -0.289424
H  -1.695606 -6.831273 -0.956557
H  -1.319992 -6.212186 0.673108
H  -1.920973 -4.003288 -2.739826
H  -1.058226 -5.473908 -3.26257
H  -0.229283 -3.895115 -3.265989
H  1.877497 -5.158866 -1.683372
H  0.922882 -6.662407 -1.774334
H  1.466363 -6.035291 -0.195721
H  2.293349 1.280557 2.175606
H  -1.918887 1.213742 1.630513
H  -1.325068 1.237203 3.294758
C  0.248329 2.727756 1.083593
C  -0.865005 3.56397 0.999687
C  1.425241 3.085086 0.422806
C  -0.799071 4.75813 0.289137
H  -1.791016 3.317751 1.501781
C  1.481606 4.24548 -0.338489
H  2.306143 2.459179 0.465887
C  0.370705 5.081148 -0.386632
N  0.434415 6.328304 -1.172202
O  0.89478 6.246911 -2.289739
O  0.020608 7.333511 -0.637884
C  -1.970854 5.594782 0.243721
N  -2.935891 6.215565 0.226958
C  2.713459 4.56303 -1.014503
N  3.721733 4.776744 -1.519155
totalener: -1450.85819463545477 hartree
nucrepener: 2195.19383107284739 hartree
electener: -3645.93622877004736 hartree
oneelecener: -6369.64109067114805 hartree
twoeener: 2723.70486190110068 hartree
cpcmener: -0.11316678388825 hartree
kineticenergy: 1355.56316451438261 hartree
exchangeener: -112.512494444061 hartree
dispersion: -0.121372700 hartree
dispersion: -0.121865768 hartree
dispersion: -0.121653044 hartree
dispersion: -0.121718028 hartree
dispersion: -0.121967401 hartree
dispersion: -0.121653393 hartree
dispersion: -0.121662237 hartree
dispersion: -0.121642714 hartree
dispersion: -0.121593442 hartree
dispersion: -0.121521667 hartree
dispersion: -0.121458391 hartree
dispersion: -0.121445356 hartree
dispersion: -0.121422914 hartree
dispersion: -0.121418427 hartree
dispersion: -0.121400294 hartree
dispersion: -0.121387497 hartree
dispersion: -0.121367259 hartree
dispersion: -0.121337260 hartree
dispersion: -0.121300152 hartree
dispersion: -0.121274719 hartree
dispersion: -0.121250787 hartree
dispersion: -0.121226889 hartree
dispersion: -0.121206555 hartree
dispersion: -0.121190861 hartree
dispersion: -0.121170751 hartree
dispersion: -0.121151714 hartree
dispersion: -0.121122409 hartree
dispersion: -0.121097542 hartree
dispersion: -0.121073574 hartree
dispersion: -0.121089537 hartree
dispersion: -0.121079729 hartree
dispersion: -0.121069537 hartree
dispersion: -0.121057436 hartree
dispersion: -0.121057916 hartree
dispersion: -0.121036349 hartree
dispersion: -0.121050120 hartree
dispersion: -0.120990145 hartree
dispersion: -0.121022788 hartree
dispersion: -0.121050838 hartree
dispersion: -0.121029522 hartree
dispersion: -0.121012111 hartree
dispersion: -0.121005272 hartree
dispersion: -0.121006238 hartree
dispersion: -0.121014579 hartree
dispersion: -0.121013554 hartree
dispersion: -0.121012938 hartree
dispersion: -0.121013181 hartree
dispersion: -0.121013391 hartree
dispersion: -0.121013196 hartree
elementType: Au C H P N O
energy: -2098.4055 -525.0471 -525.0463 -400.1331 -393.1751 -393.1747 -283.3249 -283.2302 -282.5652 -282.5630 -281.9129 -281.8785 -281.8724 -281.7352 -281.7345 -280.8212 -280.6358 -280.5603 -280.3816 -280.2733 -279.7713 -279.7698 -279.7669 -182.1906 -131.9290 -131.9283 -131.8846 -116.5790 -67.3154 -66.8461 -66.8240 -38.8176 -33.9331 -30.2327 -29.5436 -29.2955 -28.7494 -27.2307 -26.8899 -25.3389 -25.2829 -25.0885 -24.0223 -23.0061 -22.9230 -22.9200 -21.9865 -21.6228 -21.0831 -19.8481 -19.5796 -19.0319 -18.7399 -18.6966 -18.2478 -18.0649 -17.8946 -17.4843 -16.7784 -16.4937 -16.0434 -15.7544 -15.5812 -15.2460 -15.2161 -15.2069 -14.9185 -14.7029 -14.4103 -14.3761 -14.3559 -14.3238 -14.2903 -14.1184 -13.8621 -13.7209 -13.6969 -13.3454 -13.3216 -13.2780 -12.8807 -12.7693 -12.6612 -12.6208 -12.5490 -12.4027 -12.0073 -11.5543 -11.4913 -11.4523 -11.4365 -11.0736 -10.1509 -10.0525 -9.4749 -2.3830 -0.7689 -0.6907 0.5190 0.9998 1.2362 2.1219 2.1988 2.3517 2.6600 2.6660 electronvolt
chargesum: 1.0000000
charge: 0.048162 -0.162274 -0.198802 0.283252 -0.193556 0.165301 -0.182818 0.159877 0.160564 -0.298273 0.648911 -0.586304 -0.590976 0.158359 -0.592409 0.175002 0.165253 0.175480 0.175049 0.164931 0.175191 0.175089 0.165030 0.175459 0.187140 0.166600 0.191226 0.414143 -0.399689 -0.417313 0.560962 0.185389 0.539050 0.177053 -0.021398 0.557787 -0.343107 -0.343205 -0.249741 -0.159756 -0.250563 -0.160077
charge: 0.233261 -0.136897 -0.339554 0.097877 -0.142286 0.165152 -0.201922 0.156460 0.145942 -0.153594 0.629637 -0.437580 -0.437461 0.149280 -0.437426 0.124572 0.119558 0.124669 0.124524 0.119515 0.124601 0.124623 0.119481 0.124633 0.152933 0.155020 0.182088 -0.066441 0.051808 0.054727 -0.083518 0.177772 -0.083836 0.177798 0.010313 0.023402 -0.015642 -0.015330 -0.066858 0.007956 -0.066929 0.007672
qa: 0.0482 -0.1623 -0.1988 0.2833 -0.1936 0.1653 -0.1828 0.1599 0.1606 -0.2983 0.6489 -0.5863 -0.5910 0.1584 -0.5924 0.1750 0.1653 0.1755 0.1750 0.1649 0.1752 0.1751 0.1650 0.1755 0.1871 0.1666 0.1912 0.4141 -0.3997 -0.4173 0.5610 0.1854 0.5390 0.1771 -0.0214 0.5578 -0.3431 -0.3432 -0.2497 -0.1598 -0.2506 -0.1601
va: 1.6563 3.8847 3.7271 3.6622 3.8928 0.9511 3.9611 0.9635 0.9477 3.9711 4.0372 3.8403 3.8394 0.9522 3.8381 0.9552 0.9582 0.9549 0.9548 0.9582 0.9549 0.9554 0.9581 0.9550 0.9493 0.9546 0.9522 3.6443 3.8833 3.9121 3.5941 0.9534 3.6379 0.9695 4.0740 4.2133 1.9695 1.9696 3.9228 3.1439 3.9198 3.1440
dispersion: -0.121013176 hartree
energy: -1450.984330455927 hartree
dipole: 21.152695185 -21.641942095 -0.489246910 373.160036273 -378.005947410 -4.845911138 -14.982621478 17.893251238 2.910629760
dipolemethod: SCF
magnitude: 5.673974171 au
magnitude: 14.422096200 debye
temp: 298.15 k
press: 1.00 atm
zeropoint: 0.32050052 hartree
thermalvibcorrection: 0.02241426 hartree
thermalrotcorrection: 0.00141627 hartree
thermaltrasncorrection: 0.00141627 hartree
thermaltotal: -1450.63858313 hartree
thermalcorr: 0.02524680 hartree
nonthermalcorr: 0.32050052 hartree
totalcorr: 0.34574732 hartree
thermalcorrenthalpy: 0.00094421 hartree
totalenthalpy: -1450.63763893 hartree
vibrat: 0.04111552 hartree
rotat: 0.01753051 hartree
transl: 0.02121783 hartree
total: 0.07986386 hartree
totalentropycorr: -0.07986386 hartree
gibbsenthalpy: -1450.71750279 hartree
gibbsminuselec: 0.26682767 hartree
