program: Orca
programVersion: 6.1.x
elementType: Au C C C C H C H H C P C C H C H H H H H H H H H H H H C C C C H C H C F F N O O
elementType: Au
keywords: opt freq wb97x-d3bj def2-tzvp(-f) def2/J tightopt verytightscf
charge: 1
multiplicity: 1
frequency: 0.00 0.00 0.00 0.00 0.00 0.00 -67.19 -3.56 15.71 28.57 37.72 41.74 66.75 73.57 125.15 139.53 143.54 162.46 178.78 181.64 191.62 201.60 206.81 219.85 221.58 226.54 246.84 255.08 255.96 260.04 284.65 313.47 357.74 365.27 397.85 434.94 466.58 482.10 541.86 549.94 581.43 602.14 621.22 635.90 705.25 707.93 741.52 771.20 775.58 775.88 805.84 809.68 831.18 834.81 865.99 870.88 871.78 883.14 884.99 908.27 915.90 958.79 971.38 971.61 979.88 1002.53 1027.77 1034.81 1085.92 1092.91 1122.38 1152.16 1163.63 1186.28 1222.99 1245.92 1258.48 1272.09 1317.97 1328.10 1334.48 1335.39 1347.67 1364.88 1378.19 1439.71 1445.17 1447.41 1448.09 1455.07 1455.57 1461.28 1461.85 1463.33 1484.74 1529.85 1538.88 1572.22 1634.80 1641.18 1679.30 1701.09 3072.25 3072.83 3073.08 3088.98 3124.57 3139.56 3148.66 3162.00 3162.89 3163.48 3169.03 3169.18 3169.64 3205.29 3209.03 3224.16 3262.87 3271.88
frequency: 15.71 28.57 37.72 41.74 66.75 73.57 125.15 139.53 143.54 162.46 178.78 181.64 191.62 201.60 206.81 219.85 221.58 226.54 246.84 255.08 255.96 260.04 284.65 313.47 357.74 365.27 397.85 434.94 466.58 482.10 541.86 549.94 581.43 602.14 621.22 635.90 705.25 707.93 741.52 771.20 775.58 775.88 805.84 809.68 831.18 834.81 865.99 870.88 871.78 883.14 884.99 908.27 915.90 958.79 971.38 971.61 979.88 1002.53 1027.77 1034.81 1085.92 1092.91 1122.38 1152.16 1163.63 1186.28 1222.99 1245.92 1258.48 1272.09 1317.97 1328.10 1334.48 1335.39 1347.67 1364.88 1378.19 1439.71 1445.17 1447.41 1448.09 1455.07 1455.57 1461.28 1461.85 1463.33 1484.74 1529.85 1538.88 1572.22 1634.80 1641.18 1679.30 1701.09 3072.25 3072.83 3073.08 3088.98 3124.57 3139.56 3148.66 3162.00 3162.89 3163.48 3169.03 3169.18 3169.64 3205.29 3209.03 3224.16 3262.87 3271.88
formula: C15H18F2AuNO2P
InChI: InChI=1/C12H9F2NO2.C3H9P.Au/c13-10-6-9(8-4-2-1-3-5-8)7-11(14)12(10)15(16)17;1-4(2)3;/h2,6-7H,3-5H2;1-3H3;/rC15H18AuF2NO2P/c1-22(2,3)16-12-6-4-10(5-7-12)11-8-13(17)15(19(20)21)14(18)9-11/h6,8-9H,4-5,7H2,1-3H3
40 atoms
Au -0.508474 -2.389792 0.148935
C  0.649613 -0.091054 1.654845
C  -0.496746 -0.638747 1.248038
C  -0.323737 1.874314 2.110399
C  0.723306 1.082161 2.703555
H  0.473005 0.710567 3.694221
C  -1.801809 0.025266 1.529529
H  -2.514292 -0.643887 2.016077
H  -2.239936 0.318483 0.571535
C  -1.666433 1.361402 2.375707
P  -0.517769 -4.341412 -1.081302
C  -1.457544 -4.229923 -2.625945
C  1.130853 -4.898277 -1.584836
H  1.62842 -0.3853 1.291477
C  -1.235972 -5.756358 -0.207353
H  -2.270246 -5.531457 0.059931
H  -1.208974 -6.645438 -0.84182
H  -0.669942 -5.944576 0.706923
H  -2.495581 -3.976464 -2.402349
H  -1.422405 -5.182954 -3.159062
H  -1.032054 -3.445629 -3.254901
H  1.604856 -4.126328 -2.1941
H  1.057223 -5.823144 -2.161805
H  1.743116 -5.070657 -0.697629
H  1.717213 1.516862 2.687362
H  -2.474287 2.029156 2.093479
H  -1.744928 1.095584 3.430234
C  -0.05717 2.954819 1.161063
C  -1.086032 3.830629 0.803204
C  1.224853 3.11576 0.617278
C  -0.820282 4.856046 -0.080243
H  -2.084487 3.757958 1.21007
C  1.446091 4.12238 -0.291231
H  2.047732 2.458114 0.86197
C  0.434505 5.007103 -0.644845
F  -1.795844 5.698497 -0.424506
F  2.658667 4.279727 -0.825872
N  0.692533 6.085768 -1.605853
O  1.113786 5.760369 -2.694876
O  0.463456 7.21759 -1.237897
totalener: -1464.83505192274902 hartree
nucrepener: 2064.36010170907957 hartree
electener: -3529.10180852331086 hartree
oneelecener: -6140.45511362482284 hartree
twoeener: 2611.35330510151198 hartree
cpcmener: -0.08853690708015 hartree
kineticenergy: 1369.76538391214649 hartree
exchangeener: -110.669535087518 hartree
dispersion: -0.110214596 hartree
dispersion: -0.110469002 hartree
dispersion: -0.110322268 hartree
dispersion: -0.110146331 hartree
dispersion: -0.110456096 hartree
dispersion: -0.110241830 hartree
dispersion: -0.110259177 hartree
dispersion: -0.110261304 hartree
dispersion: -0.110267677 hartree
dispersion: -0.110250339 hartree
dispersion: -0.110232691 hartree
dispersion: -0.110219060 hartree
dispersion: -0.110213641 hartree
dispersion: -0.110213862 hartree
dispersion: -0.110217059 hartree
dispersion: -0.110221074 hartree
dispersion: -0.110225135 hartree
dispersion: -0.110229799 hartree
dispersion: -0.110232505 hartree
dispersion: -0.110233291 hartree
dispersion: -0.110232819 hartree
elementType: Au C H P F N O
energy: -2098.3815 -675.3770 -675.3658 -524.8133 -524.8119 -399.9460 -283.5780 -283.5678 -283.0421 -282.5723 -281.7314 -281.1615 -281.1177 -280.7235 -280.5471 -280.4796 -280.4786 -280.1558 -279.7511 -279.7506 -279.7499 -182.1658 -131.9039 -131.9037 -131.8600 -116.5133 -67.2467 -66.7793 -66.7669 -38.6585 -38.3365 -38.2584 -33.6588 -29.4446 -28.4670 -26.8972 -25.7146 -25.2846 -25.1252 -24.8855 -23.6623 -22.9027 -22.9018 -22.1790 -21.5880 -21.2966 -20.4591 -19.6364 -19.5950 -19.0910 -18.7132 -18.4960 -18.1756 -18.0724 -17.9265 -17.5125 -17.3389 -17.0604 -16.6727 -16.2160 -15.8744 -15.7067 -15.5583 -15.2042 -15.1949 -15.1210 -14.8056 -14.6628 -14.6012 -14.3489 -14.3372 -14.3312 -14.0644 -13.8441 -13.6572 -13.3720 -12.7410 -12.6738 -12.5836 -12.4407 -12.4283 -12.3649 -11.8854 -11.4662 -11.4124 -11.3937 -11.2161 -10.5867 -10.0783 -9.9695 -9.3423 -2.1322 -0.3568 0.8152 0.9752 1.2481 1.6241 2.1120 2.4445 2.7216 2.8811 3.4261 electronvolt
chargesum: 1.0000000
charge: 0.049629 -0.173952 -0.214828 0.294109 -0.195863 0.166353 -0.182825 0.153189 0.161905 -0.251489 0.648600 -0.589715 -0.593849 0.154609 -0.587958 0.174710 0.164385 0.175247 0.174553 0.164454 0.175144 0.175176 0.165183 0.175200 0.178744 0.164187 0.166806 0.421627 -0.334934 -0.321958 0.278342 0.149105 0.275010 0.156702 0.127332 -0.226491 -0.227332 0.487545 -0.338676 -0.337975
charge: 0.230565 -0.137487 -0.360558 0.092479 -0.141392 0.158263 -0.186834 0.144680 0.156408 -0.137276 0.629778 -0.438008 -0.437727 0.150587 -0.437850 0.124432 0.119239 0.124515 0.124385 0.119238 0.124482 0.124538 0.119306 0.124516 0.153680 0.147713 0.163123 -0.072723 -0.014197 -0.013850 -0.124908 0.169113 -0.126077 0.171128 -0.047946 0.128494 0.127572 0.017012 -0.034488 -0.033923
qa: 0.0496 -0.1740 -0.2148 0.2941 -0.1959 0.1664 -0.1828 0.1532 0.1619 -0.2515 0.6486 -0.5897 -0.5938 0.1546 -0.5880 0.1747 0.1644 0.1752 0.1746 0.1645 0.1751 0.1752 0.1652 0.1752 0.1787 0.1642 0.1668 0.4216 -0.3349 -0.3220 0.2783 0.1491 0.2750 0.1567 0.1273 -0.2265 -0.2273 0.4875 -0.3387 -0.3380
va: 1.6481 3.9477 3.7994 3.7362 3.8660 0.9522 3.9702 0.9508 0.9481 4.0003 4.0374 3.8390 3.8404 0.9515 3.8396 0.9552 0.9582 0.9548 0.9554 0.9583 0.9549 0.9551 0.9582 0.9550 0.9530 0.9591 0.9574 3.4768 3.8511 3.8480 4.0276 0.9822 4.0456 0.9827 3.7899 1.1051 1.1036 4.2544 1.9685 1.9688
dispersion: -0.110232157 hartree
energy: -1464.947939068258 hartree
dipole: 36.109766149 -36.997489333 -0.887723184 318.971947325 -321.913698506 -2.941751181 -17.697360547 20.284934506 2.587573959
dipolemethod: SCF
magnitude: 4.017149668 au
magnitude: 10.210782992 debye
temp: 298.15 k
press: 1.00 atm
zeropoint: 0.30750956 hartree
thermalvibcorrection: 0.01957062 hartree
thermalrotcorrection: 0.00141627 hartree
thermaltrasncorrection: 0.00141627 hartree
thermaltotal: -1464.61802635 hartree
thermalcorr: 0.02240316 hartree
nonthermalcorr: 0.30750956 hartree
totalcorr: 0.32991272 hartree
thermalcorrenthalpy: 0.00094421 hartree
totalenthalpy: -1464.61708214 hartree
vibrat: 0.03508152 hartree
rotat: 0.01730959 hartree
transl: 0.02117938 hartree
total: 0.07357050 hartree
totalentropycorr: -0.07357050 hartree
gibbsenthalpy: -1464.69065263 hartree
gibbsminuselec: 0.25728643 hartree
