program: Gaussian 16
title: Checking optimization
version: ES64L-G16RevA.03
frameworkgroup: C1[X(CH4Mo6O22Pt)]
method: RM06L
basis: def2TZVP
operation: Freq
keyword: #P
keyword: Geom=AllCheck
keyword: Guess=TCheck
keyword: SCRF=Check
keyword: GenChk
keyword: RM06L/def2TZVPFreq
converged: YES YES YES YES
title: Mulliken charges:
elementType: Pt Mo Mo Mo Mo Mo O O O O O O O O O O O O H H Mo O O O O O O O O H O C O H
charge: 0.631831 1.908726 1.885005 1.736048 1.804938 1.604621 -0.833446 -0.639656 -0.607561 -0.821914 -0.785139 -0.822536 -0.646175 -0.742932 -0.752249 -0.589427 -0.589628 -0.581122 0.396442 0.343768 1.764768 -0.734146 -0.626222 -0.660805 -0.620172 -0.631196 -0.861302 -0.602682 -0.662076 0.420291 -0.756467 0.233356 -0.281037 0.118095
chargesum: -2.00000
title: Mulliken charges with hydrogens summed into heavy atoms:
elementType: Pt Mo Mo Mo Mo Mo O O O O O O O O O O O O Mo O O O O O O O O O C O
charge: 0.631831 1.908726 1.885005 1.736048 1.804938 1.604621 -0.413155 -0.639656 -0.607561 -0.425472 -0.785139 -0.822536 -0.646175 -0.742932 -0.408481 -0.589427 -0.589628 -0.581122 1.764768 -0.734146 -0.626222 -0.660805 -0.620172 -0.631196 -0.861302 -0.484587 -0.662076 -0.756467 0.233356 -0.281037
polarizability: 4.32108901e+02 4.95030671e+00 3.65222527e+02 2.20550270e+00 -5.97023288e+00 3.26668032e+02
1716.lowfreq: -691.2966 -5.5009 -1.6812 -0.0005 -0.0003 -0.0003 3.9006 21.6659 30.0711
frequency: -691.2964 21.6289 30.0401 34.7713 40.2547 43.9117 52.9109 55.6187 66.7684 71.2661 74.6894 78.7733 90.9945 94.1541 102.8896 105.2372 108.4944 123.8316 140.9836 144.7181 145.9885 160.5879 161.6468 166.4138 179.5264 186.0480 188.8940 194.6137 198.4740 205.8156 209.1178 213.1017 217.6771 231.2350 235.1278 239.5066 249.3326 261.8670 273.0864 291.1193 304.0044 309.4389 310.5676 315.9400 328.5518 336.3069 348.5511 355.3291 359.1339 362.9442 367.3456 370.7897 371.7989 377.2662 453.3005 478.3718 486.6868 494.6542 508.0576 522.3993 535.3214 538.3142 545.5528 555.5649 562.2502 579.8359 587.9753 624.3217 649.8349 682.6800 691.2927 736.9919 791.7865 802.7004 851.2089 855.9670 880.9752 886.7406 902.6017 943.4724 947.3381 953.7685 960.3834 964.9092 967.6838 982.9626 984.8790 986.8948 990.9780 995.3852 1041.2824 1074.3586 2122.6070 3582.0930 3606.1303 3832.9374
redmass: 1.8357 25.7883 23.1045 27.0082 23.5228 26.2695 23.4114 29.4221 16.6060 18.2532 23.9726 19.5011 21.3629 16.6660 16.0372 17.3235 25.0431 15.4917 15.9984 24.8815 18.5473 21.7654 20.3053 17.7854 11.7325 25.2806 19.0934 15.7141 14.8406 16.6267 14.6939 16.8111 12.6879 17.0135 16.1270 15.2647 17.0673 16.9410 13.8270 12.0392 15.3874 11.3782 14.7517 10.9251 10.8929 12.1775 16.3007 11.9634 16.9477 17.2618 14.4419 14.3678 13.1581 11.6642 7.9109 2.7124 11.2152 17.9049 2.1475 6.1282 10.4595 8.3366 9.0679 7.8374 8.3107 6.3216 13.0383 15.1477 1.7369 13.8855 9.3546 6.5654 2.8227 1.8834 1.3586 2.6679 4.7045 1.3986 2.1588 3.8803 6.2413 12.5602 10.9863 8.1823 5.8474 16.0845 11.3430 6.0286 4.6886 15.0550 1.1125 1.1994 12.8813 1.0677 1.0656 1.0658
irintensity: 1472.9903 0.1478 1.3756 0.1324 0.0363 0.1857 0.1057 0.5757 0.3325 1.6188 0.9470 0.3824 0.3093 0.3597 0.7738 2.1217 2.2003 5.4519 0.3610 5.0126 2.2253 1.9280 2.4787 4.2973 3.9351 19.8846 6.0859 10.2058 2.0431 1.0148 19.9254 27.1716 1.6810 25.0324 10.0249 8.7117 14.5645 37.7463 20.8107 0.0360 23.5824 119.3885 2.1044 6.2064 22.7818 32.7175 13.8264 19.1462 22.6477 45.7885 15.8376 3.5130 40.5106 7.1461 21.8731 146.2052 28.3988 3.0249 25.4402 91.8256 85.3663 22.2242 8.6053 86.2262 111.4192 24.9103 217.0522 324.9050 57.3190 44.7936 658.1118 789.2310 674.8240 346.0169 109.9294 124.2029 318.2928 276.6548 485.9095 155.6821 368.5327 168.0839 372.0024 296.7504 238.7296 30.6323 58.5196 180.3651 92.3552 110.3609 26.5337 161.9365 723.3511 199.4317 183.4434 47.7390
temp: 298.150 k
press: 1.00000 atm
elementType: 78 42 42 42 42 42 8 8 8 8 8 8 8 8 8 8 8 8 1 1 42 8 8 8 8 8 8 8 8 1 8 6 8 1
symmnumber: 1
zpe: 314932.1 jmol-1
zpe.correction: 0.119951 hartree
zpe.thermalcorrener: 0.157975 hartree
zpe.thermalcorrenthalpy: 0.158919 hartree
zpe.thermalcorrgfe: 0.047005 hartree
zpe.sumelectzpe: -2226.125730 hartree
zpe.sumelectthermal: -2226.087706 hartree
zpe.sumelectthermalent: -2226.086762 hartree
zpe.sumelectthermalfe: -2226.198676 hartree
dipole: 0.2500 -5.3761 -3.6791
dipole: 6.5193
quadrupole: -411.7552 -350.5853 -349.1088
quadrupole: 7.9842 3.9795 6.1632
quadrupole: -41.2721 19.8978 21.3743 7.9842 3.9795 6.1632
hfenergy: -2226.2456813 hartree
pointgroup: C01 [X(C1H4Mo6O22Pt1)]
dipole: 0.0673307 -2.1156374 -1.4485068 debye
polarizability: 432.2341505|4.1025176|365.1151423|1.7739084|-5.996331|326.6501665 unknown
InChI: InChI=1/CO.6Mo.2H2O.HO.18O.Pt.H/c1-2;;;;;;;;;;;;;;;;;;;;;;;;;;;;;/h;;;;;;;2*1H2;1H;;;;;;;;;;;;;;;;;;;;/q;;;;;2*+1;;;;;;;;;;;;;;;;;;;;;;;/p-2/rCH4Mo6O22Pt/c8-1-30-5(16,17,18)24-2(9,10)23-3(11,12)25-6(19,20)27-7(21,22,28-6)26-4(13,14,15)29-30/h13,16,29-30H
charge -2 multiplicity 1
34 atoms
Pt -0.88998171 -1.6632833 -0.5090183
Mo 4.25597721 -0.22290528 0.76514553
Mo 2.01891369 2.48917705 0.78326149
Mo -2.86724057 -0.72603795 2.16508586
Mo -0.61515442 2.03024351 -1.81297716
Mo 1.98192578 -2.01632391 -0.80499583
O  1.83056476 -0.38134601 0.37879458
O  5.94150812 -0.1148054 0.5619425
O  1.05898999 1.835334 2.03269924
O  -0.84059844 -0.43158905 1.13133414
O  1.09193649 2.55114019 -0.76625311
O  3.81796073 -1.54524009 -0.55888495
O  -0.48081042 3.34032429 -2.89205393
O  -2.42094384 1.49820608 -2.10284038
O  -2.25276198 -2.45736021 1.24044914
O  4.01707426 -0.81658117 2.33666275
O  1.79901719 -3.58024013 -0.17123531
O  1.81677036 -2.09360683 -2.49374663
H  -0.69446742 0.52318946 0.99343878
H  -3.04440443 -2.92604158 0.95708143
Mo -3.16855837 1.29063365 -0.30866745
O  -3.02714385 1.07268874 1.6716585
O  -4.4733723 -1.29712483 2.302248
O  -4.56558954 2.2576957 -0.41380473
O  -3.52367746 -0.4181764 -0.42966599
O  -2.24255642 -0.76028248 3.74101457
O  3.71226296 1.5739887 0.61835287
O  0.17024106 0.55356987 -2.40312526
O  2.42413543 4.08633565 1.22589563
H  1.11857336 -0.37092422 1.04382425
O  -1.36608653 2.12386726 -0.03047524
C  -0.96112533 -2.79849882 -1.93815511
O  -1.04498067 -3.5006548 -2.83993626
H  -0.20739767 -0.56837171 -1.58505361
