program: Gaussian 16
title: Checking optimization
version: ES64L-G16RevC.02
frameworkgroup: C1[X(CH4Mo6O22Pt)]
method: RM06L
basis: def2TZVP
operation: Freq
keyword: #P
keyword: Geom=AllCheck
keyword: Guess=TCheck
keyword: SCRF=Check
keyword: GenChk
keyword: RM06L/def2TZVPFreq
converged: YES YES YES YES
title: Mulliken charges:
elementType: Pt Mo Mo Mo Mo Mo O O O O O O O O O O O O H H Mo O O O O O O O O H C O O H
charge: 0.724200 1.900755 1.842554 1.746664 1.786759 1.575465 -0.827988 -0.643972 -0.576967 -0.815584 -0.797256 -0.825911 -0.636361 -0.753097 -0.761163 -0.593023 -0.592510 -0.612382 0.440251 0.352592 1.784748 -0.753533 -0.626742 -0.657846 -0.610072 -0.633815 -0.844043 -0.636475 -0.644909 0.451435 0.302082 -0.419992 -0.786486 0.142622
chargesum: -2.00000
title: Mulliken charges with hydrogens summed into heavy atoms:
elementType: Pt Mo Mo Mo Mo Mo O O O O O O O O O O O O Mo O O O O O O O O C O O
charge: 0.724200 1.900755 1.842554 1.746664 1.786759 1.575465 -0.376553 -0.643972 -0.576967 -0.375333 -0.797256 -0.825911 -0.636361 -0.753097 -0.408571 -0.593023 -0.592510 -0.612382 1.784748 -0.753533 -0.626742 -0.657846 -0.610072 -0.633815 -0.844043 -0.636475 -0.644909 0.444704 -0.419992 -0.786486
polarizability: 4.36658942e+02 2.01606427e+00 3.65779029e+02 -1.45657580e+00 1.35110140e+01 3.04451542e+02
1716.lowfreq: -217.3157 -5.3750 -0.0004 -0.0004 -0.0002 2.7985 4.7187 27.6081 28.4999
frequency: -217.3155 27.6078 28.4388 39.6280 41.0010 49.0581 56.7007 66.6043 67.2470 74.3228 81.4341 83.2817 95.1366 97.8212 108.6997 120.4118 126.8824 140.0075 142.1698 147.3478 152.0767 167.2721 170.2223 182.6559 185.4944 185.7735 192.7634 201.6247 206.1132 211.6418 217.8034 226.0532 228.8995 242.4302 253.2909 256.0673 270.7769 274.5475 283.4354 310.9384 313.5617 315.2400 321.6057 327.3067 330.1985 343.8803 347.8287 354.9985 356.4177 363.9391 367.5791 372.4262 375.6598 392.1363 422.5747 450.1368 466.9864 482.7126 502.4426 511.6711 521.3305 545.1559 564.7563 583.1361 597.4258 623.3484 641.4944 672.2095 689.9182 715.4597 749.0394 778.2879 794.8306 844.3829 875.3363 901.7957 942.7805 949.4251 950.5068 957.3106 962.3274 966.1647 977.7595 983.5764 985.5117 989.2517 997.6647 1009.7506 1082.5016 1102.4755 1110.9941 1534.9658 3140.6045 3339.7073 3388.4039 3834.3810
redmass: 13.1986 25.2197 24.4895 25.0836 25.3461 26.5342 21.9423 29.0538 19.0273 19.3824 22.5106 18.6612 21.5373 27.8277 13.9065 17.1380 11.2428 16.3612 20.4682 19.6016 12.9344 20.1641 16.8107 16.7220 19.4255 12.5320 18.0350 13.7939 14.5387 23.3679 18.9811 16.7889 14.3751 15.6730 15.3257 13.7087 11.9888 16.1208 16.9147 13.6823 14.8287 13.4076 16.7078 10.4977 14.1566 13.7071 14.7368 10.5294 15.9667 16.3072 15.2836 13.5702 15.0529 9.0272 10.7998 12.5877 7.0134 4.6732 8.4604 11.0697 6.4115 11.4253 3.0225 6.8122 9.7875 14.1178 4.1246 10.0932 6.7692 2.7555 2.5449 5.4857 7.6165 11.0133 1.2967 13.0870 3.8568 7.8949 6.6043 3.4686 15.5120 3.0342 13.6347 13.9012 13.9203 7.0681 17.0355 1.2677 1.1129 1.0790 1.3422 9.7495 1.0980 1.0693 1.0664 1.0658
irintensity: 110.6454 0.1918 0.0211 0.1930 0.3308 0.0986 1.5229 0.2737 0.2174 0.9708 1.4642 0.5188 0.9980 2.3326 2.5377 2.7159 2.1385 1.8731 2.2706 2.5952 0.7139 5.2764 0.2118 5.2662 16.0546 1.4037 3.7413 5.6918 8.1404 3.1128 38.5634 6.6432 37.6385 26.0324 28.9322 14.4816 9.9026 18.8125 21.0121 73.3207 13.9571 2.6884 5.7122 18.0276 24.1266 23.8543 27.8176 22.1219 16.9458 2.3464 19.2147 1.2830 4.2646 14.2555 110.2780 14.1276 84.5642 41.8770 6.3321 13.6122 127.3477 50.6308 77.2590 188.2510 15.7463 370.2431 28.0148 402.8540 257.9946 117.8647 147.5901 1184.0868 439.7107 226.0703 62.1803 262.6292 158.1447 64.6106 76.8318 542.1564 22.4267 250.2692 416.2784 157.8252 73.7853 109.0411 106.9303 21.0824 112.6749 43.2208 55.2363 172.9354 5.8415 534.2543 195.8543 55.2959
temp: 298.150 k
press: 1.00000 atm
elementType: 78 42 42 42 42 42 8 8 8 8 8 8 8 8 8 8 8 8 1 1 42 8 8 8 8 8 8 8 8 1 6 8 8 1
symmnumber: 1
zpe: 329194.1 jmol-1
zpe.correction: 0.125383 hartree
zpe.thermalcorrener: 0.162569 hartree
zpe.thermalcorrenthalpy: 0.163514 hartree
zpe.thermalcorrgfe: 0.054253 hartree
zpe.sumelectzpe: -2226.061743 hartree
zpe.sumelectthermal: -2226.024557 hartree
zpe.sumelectthermalent: -2226.023613 hartree
zpe.sumelectthermalfe: -2226.132874 hartree
dipole: -1.4414 -2.4728 5.5074
dipole: 6.2068
quadrupole: -417.8945 -360.3438 -334.6993
quadrupole: -1.5728 1.5544 -6.9282
quadrupole: -46.9153 10.6354 36.2799 -1.5728 1.5544 -6.9282
hfenergy: -2226.1871266 hartree
pointgroup: C01 [X(C1H4Mo6O22Pt1)]
dipole: -0.8553147 -1.2219391 1.9334729 debye
polarizability: 434.8466199|-11.5116993|360.7063922|7.436685|22.6582252|311.3365013 unknown
InChI: InChI=1/CHO.6Mo.H2O.2HO.18O.Pt/c1-2;;;;;;;;;;;;;;;;;;;;;;;;;;;;/h1H;;;;;;;1H2;2*1H;;;;;;;;;;;;;;;;;;;/q-1;;;;;;+1;;;;;;;;;;;;;;;;;;;;;;+1/p-1/rCH4Mo6O22Pt/c8-2(9)22-3(10,11)24-5(15,16)25-6(17,18,26-5)27-7(19,20)28-30(29-7,1-21-30)4(12,13,14)23-2/h1,12,28-29H
charge -2 multiplicity 1
34 atoms
Pt 0.39931309 -1.37278369 0.91558881
Mo -4.27886194 0.78969298 -0.95671445
Mo -1.40500187 2.71294186 -0.60932017
Mo 2.21629705 -2.0198713 -1.91757434
Mo 1.66048876 2.05815424 1.42857944
Mo -2.48305529 -1.49962876 0.58199833
O  -1.94976114 0.02885058 -0.58822924
O  -5.89568004 1.27432977 -0.74151708
O  -0.80321365 2.19246019 -2.11223676
O  0.49728329 -0.75093139 -1.0453308
O  -0.2828649 2.19989173 0.73199754
O  -4.20731714 -0.81622932 0.09160709
O  1.90842275 3.70347277 1.76914949
O  3.43785937 1.36336137 1.50456458
O  1.2181109 -3.00428557 -0.42194223
O  -4.10729633 0.4775625 -2.61523185
O  -2.3804656 -3.09865787 0.03255162
O  -2.57586929 -1.47609619 2.28619096
H  0.85713223 0.16667516 -1.0123678
H  1.81971332 -3.6222622 0.00517593
Mo 3.62507721 0.32950748 -0.13156164
O  3.03648118 -0.35481891 -1.93880183
O  3.48816754 -3.16277613 -1.8939559
O  5.22641565 0.73598067 -0.55656582
O  3.48050017 -1.26618285 0.53206021
O  1.42896935 -2.25378357 -3.40223012
O  -3.29960418 2.30251722 -0.41218419
O  1.04017109 1.18740649 2.84268304
O  -1.38997132 4.41540156 -0.64458475
H  -1.1416409 -0.17504816 -1.11498485
C  -0.13736439 -0.36122701 2.47604319
O  0.25195622 -1.39146841 3.04400282
O  1.95548687 1.4312125 -0.38744996
H  -0.93087803 0.31663228 2.77959075
