program: Gaussian 16
title: Checking optimization
version: ES64L-G16RevC.02
frameworkgroup: C1[X(CH5Mo6O22Pt)]
method: UM06L
basis: def2TZVP
operation: Freq
keyword: #P
keyword: Geom=AllCheck
keyword: Guess=TCheck
keyword: SCRF=Check
keyword: GenChk
keyword: UM06L/def2TZVP
keyword: Freq
converged: YES YES YES YES
polarizability: 4.90080358e+02 -6.71207520e+00 3.62486424e+02 1.08944085e-01 -9.39976944e+00 2.95240709e+02
1716.lowfreq: -281.3643 -1.4217 -0.0003 -0.0002 0.0002 3.0087 4.8131 13.5065 23.1336
frequency: -281.3641 13.1664 23.1227 24.7758 32.9965 42.0897 46.4261 57.7256 61.6238 70.3665 73.0636 82.2591 85.0521 96.5165 98.1890 107.0220 112.5384 117.0399 134.1231 144.1285 149.6847 159.0255 162.2332 174.4666 177.4016 184.0933 186.6858 189.0310 193.6249 195.2180 199.0573 205.6603 210.4019 217.2069 231.4806 241.2509 245.1634 256.8869 267.4092 281.0032 286.8238 299.0598 305.2581 308.5000 321.1120 324.4021 325.8474 332.7006 345.1033 350.2819 356.1485 360.6831 361.8288 363.7139 369.0643 375.9281 395.5549 406.6838 417.0109 467.3902 481.6352 506.1035 522.2953 548.7191 558.8643 561.7315 571.4956 602.4791 633.3260 642.1916 653.3170 699.3125 760.7247 782.9210 793.0379 815.9436 824.3960 850.2314 941.7167 944.6332 948.8917 950.9623 958.2830 960.9219 971.9254 976.1640 981.1301 984.6981 989.0464 993.1224 1000.0051 1053.3729 1206.8131 1537.8767 2873.2110 3754.3268 3774.7951 3791.6164 3801.7061
redmass: 10.2918 24.2748 24.4008 24.6440 27.1298 20.3463 22.6285 25.2379 20.7947 15.0744 24.2974 18.7868 23.6557 18.7214 20.8685 18.4928 12.2527 17.8924 12.3972 17.9588 22.3185 15.3213 14.6264 17.4036 19.1199 15.9296 17.3097 15.1916 17.1152 15.9203 15.9251 16.9896 14.8873 10.1172 9.5032 12.5352 11.0222 20.1095 8.5107 14.0668 16.0787 11.7943 13.5115 9.1911 9.4122 13.6835 11.6562 11.9853 14.0097 14.8194 11.2483 11.9489 11.7829 15.7566 13.8337 9.0349 12.0014 11.0574 11.9762 2.6821 13.0092 8.0068 16.8890 7.5057 6.9284 2.1186 3.5308 1.2702 1.2846 1.5122 3.4305 8.1884 9.0299 2.7878 2.5008 1.2177 1.7896 1.8772 15.2398 11.7188 14.0170 11.4305 12.8583 16.7321 4.5681 2.7438 14.0994 4.0119 15.7048 5.5858 9.1549 1.2692 1.1581 11.1416 1.0812 1.0655 1.0654 1.0661 1.0657
irintensity: 193.7356 0.4673 0.6193 0.2433 0.1067 0.5120 0.8275 0.1973 0.4144 0.6790 1.1921 0.4494 0.0701 0.3035 0.0747 5.6233 0.8513 3.8886 2.0171 2.2056 0.8081 2.8242 2.2539 1.2506 0.2521 4.9000 0.7281 3.0454 1.5516 1.4848 2.1801 4.6549 2.3194 13.0671 5.1680 39.7093 11.6350 9.8511 41.6933 28.6627 58.0956 5.9255 17.6404 66.9781 26.6533 16.0022 21.8309 12.2703 6.5335 1.9165 10.6684 5.2536 6.0499 10.5202 2.7084 24.9143 42.8975 10.6413 25.7842 10.8169 23.9757 137.7201 18.2748 17.2045 35.6460 34.6319 9.8114 61.6157 14.9818 62.2507 301.8369 894.8072 1590.5088 134.5261 332.0575 12.9463 357.8903 167.0787 120.9156 124.1821 36.8994 86.4370 180.8459 545.9948 328.7135 164.5653 228.5285 85.8958 304.6367 60.0886 91.4852 70.5424 7.1752 196.9791 40.3114 44.9134 43.1108 21.0420 44.5994
temp: 298.150 k
press: 1.00000 atm
elementType: 78 42 42 42 42 42 8 8 8 8 8 8 8 8 8 8 8 8 1 1 42 8 8 8 8 8 8 8 8 1 6 8 8 1 1
symmnumber: 1
zpe: 351859.1 jmol-1
zpe.correction: 0.134016 hartree
zpe.thermalcorrener: 0.173187 hartree
zpe.thermalcorrenthalpy: 0.174131 hartree
zpe.thermalcorrgfe: 0.058165 hartree
zpe.sumelectzpe: -2226.654588 hartree
zpe.sumelectthermal: -2226.615417 hartree
zpe.sumelectthermalent: -2226.614473 hartree
zpe.sumelectthermalfe: -2226.730439 hartree
dipole: -0.9586 -3.1285 -0.6169
dipole: 3.3297
quadrupole: -452.5228 -366.2800 -318.5322
quadrupole: 1.8901 3.4396 -4.6591
quadrupole: -73.4111 12.8317 60.5795 1.8901 3.4396 -4.6591
hfenergy: -2226.7886045 hartree
pointgroup: C01 [X(C1H5Mo6O22Pt1)]
dipole: 0.4255582 -1.2072963 0.2782761 debye
polarizability: 489.3415013|11.7631033|363.7105358|-0.2665291|7.4485034|294.7554536 unknown
InChI: InChI=1/CHO.6Mo.4H2O.17O.Pt/c1-2;;;;;;;;;;;;;;;;;;;;;;;;;;;;/h1H;;;;;;;4*1H2;;;;;;;;;;;;;;;;;;/q;;;;2*+1;+2;;;;;;;;;;;;;;;;;;;;;;/p-4/rCH5Mo6O22Pt/c8-1-30-7(22,23,24)29-3(11,12)25-2(9,10)27-6(19,20,21)28-4(13,14)26-5(15,16,17)18/h1,15-16,19,22H
charge -2 multiplicity 2
35 atoms
Pt 0.11648293 -1.02931447 0.13669379
Mo -4.61514441 -0.08379002 0.00962691
Mo -2.19210879 2.12102311 -0.98973519
Mo 2.96016184 -1.89617875 -0.91475247
Mo 1.2344837 2.53082482 0.31167723
Mo -2.12231718 -2.20278668 0.68027278
O  -2.20222667 -0.42124271 -0.72378405
O  -6.09289407 0.24022823 0.79331655
O  -2.26710063 1.65497863 -2.62580277
O  2.1519887 0.13567296 -0.7330966
O  -0.48397533 1.85126212 -0.2967803
O  -3.91642891 -1.52370946 0.9903831
O  0.90714636 4.02473652 1.03055297
O  2.96413052 2.00097238 1.14458624
O  1.10309881 -1.9423283 -1.75449845
O  -5.01152813 -0.58798771 -1.56871525
O  -2.24629921 -3.39843445 -0.52327704
O  -1.70950058 -2.98402571 2.13824913
H  1.90256529 0.50185859 -1.59380715
H  0.78229467 -2.84814997 -1.83796565
Mo 4.26573379 0.85160622 0.46347376
O  3.97401939 -1.04631891 0.47770509
O  2.83546605 -3.47746464 -0.292402
O  4.84238535 1.37647582 -1.04660235
O  5.55706826 1.01742756 1.56453662
O  3.98303379 -1.95286823 -2.26777873
O  -3.77275955 1.61595863 -0.0313831
O  0.63700445 1.17183239 1.92197854
O  -2.36189874 3.81085427 -0.99418264
H  -2.2429494 -0.71866661 -1.64308525
C  -0.47155957 -0.29225042 1.88554277
O  -1.65964287 0.02557025 1.98951733
O  1.87196112 2.89551019 -1.22797673
H  1.44271829 0.85864357 2.35118739
H  0.06159075 -0.78491922 2.7233255
