program: Gaussian 16
title: Checking optimization
version: ES64L-G16RevC.02
frameworkgroup: C1[X(CH5Mo6O22Pt)]
method: UM06L
basis: def2TZVP
operation: Freq
keyword: #P
keyword: Geom=AllCheck
keyword: Guess=TCheck
keyword: SCRF=Check
keyword: GenChk
keyword: UM06L/def2TZVP
keyword: Freq
converged: YES YES YES YES
polarizability: 4.56070142e+02 -2.04705120e+00 3.49026444e+02 8.93868598e+00 -8.81889638e+00 3.32577281e+02
1716.lowfreq: 0.0002 0.0003 0.0004 3.2794 4.3935 6.1880 26.2250 37.5685 40.0738
frequency: 26.1806 37.5502 40.0651 43.7466 53.5783 59.9290 62.0886 66.4324 69.7122 78.6715 86.1907 88.5465 92.7774 106.2490 112.0154 116.8523 126.9031 133.9812 137.1521 143.9640 150.4569 154.8651 161.0000 164.6176 172.1650 181.1940 183.1535 189.7895 191.2694 199.0258 203.6529 207.4616 217.8783 224.2077 225.7093 237.9331 239.9172 259.3318 265.9638 276.5331 285.9122 296.1863 299.7109 309.0639 312.8695 319.0242 323.8899 332.5086 338.5384 344.5532 357.0762 360.1181 363.9381 367.8082 369.7574 379.8254 411.5912 424.0942 436.5143 451.1087 481.6078 500.4507 506.1204 550.5464 565.0683 602.5709 619.0168 641.0410 664.9518 681.5740 736.5836 774.9072 788.0439 801.4478 849.9994 860.4300 868.0953 871.2455 882.8166 905.9561 917.6174 942.9472 945.5342 953.0426 960.6031 967.0549 974.6222 980.5456 988.2187 990.9271 997.9240 1086.2509 1356.5194 1696.1139 2693.4135 3329.2969 3499.7919 3661.8724 3767.2364
redmass: 22.7782 17.7912 23.4612 19.4616 24.2596 19.0176 16.4007 23.0637 15.7916 17.3320 17.3689 20.1292 17.5888 18.3821 19.2572 14.1920 23.6160 12.3507 14.6813 7.8634 14.7182 17.3214 19.4435 17.1203 4.8984 14.8363 14.2777 18.6229 16.9972 11.1360 14.7779 12.9256 11.8857 14.8767 14.9190 11.4955 15.0045 10.5681 15.0320 10.2512 11.0305 12.4091 13.9353 13.2833 12.8457 13.8986 14.5792 12.4754 14.9300 15.0302 15.1127 13.2663 14.4114 14.3654 16.1175 13.5480 13.9983 13.5756 10.8802 7.6167 15.6611 1.8449 2.8317 17.0060 1.3358 3.4663 1.6111 2.5844 14.6813 14.7448 16.5681 10.7175 14.0244 10.2007 15.9399 1.1777 1.7171 1.7465 1.5814 1.3620 1.4459 8.1427 13.3623 8.6785 12.3547 17.6704 12.9276 16.5898 14.4697 14.3695 11.5003 1.0788 1.1737 12.4383 1.0781 1.0695 1.0678 1.0658 1.0660
irintensity: 0.1086 0.5984 0.5072 1.1547 0.5669 0.1496 2.5003 0.3903 0.2655 0.0541 0.0989 1.0742 0.9598 0.7208 2.1965 1.3199 3.1851 2.1538 7.4102 6.5752 2.0758 0.5492 0.5715 0.9773 6.0199 6.8255 3.7685 4.1384 7.9379 2.6081 3.2227 13.9730 29.2325 4.9702 22.3731 3.9720 1.1547 17.7112 3.4153 20.5435 24.2785 61.4978 20.9780 31.2065 1.4574 17.2713 16.7875 1.8049 13.3651 9.7073 17.1590 22.2061 16.0023 8.8649 24.0428 13.0750 0.9103 25.8071 11.7383 17.3623 72.7210 92.9294 5.6702 23.6100 155.9291 30.7804 163.5104 96.0090 197.5620 112.9836 401.4476 774.7162 510.0896 135.8242 342.9188 129.0683 146.6381 29.3712 58.4743 191.3766 274.2602 167.2149 148.8272 245.7087 439.8920 249.1818 194.2582 37.0665 147.2534 223.6381 170.3530 41.4656 22.4229 435.8316 102.7552 488.3384 353.1610 295.5014 33.7190
temp: 298.150 k
press: 1.00000 atm
elementType: 78 42 42 42 42 42 8 8 8 8 8 8 8 8 8 8 8 8 1 1 42 8 8 8 8 8 8 8 8 1 6 8 8 1 1
symmnumber: 1
zpe: 351312.2 jmol-1
zpe.correction: 0.133808 hartree
zpe.thermalcorrener: 0.173232 hartree
zpe.thermalcorrenthalpy: 0.174176 hartree
zpe.thermalcorrgfe: 0.059885 hartree
zpe.sumelectzpe: -2226.686258 hartree
zpe.sumelectthermal: -2226.646835 hartree
zpe.sumelectthermalent: -2226.645890 hartree
zpe.sumelectthermalfe: -2226.760181 hartree
dipole: 0.8360 -1.1664 -2.9540
dipole: 3.2841
quadrupole: -406.5926 -356.4766 -344.9411
quadrupole: -1.5404 -0.3390 -0.2278
quadrupole: -37.2558 12.8602 24.3957 -1.5404 -0.3390 -0.2278
hfenergy: -2226.8200661 hartree
pointgroup: C01 [X(C1H5Mo6O22Pt1)]
dipole: 0.2409218 -0.810103 -0.9773121 debye
polarizability: 455.9775149|-7.8625546|342.9412974|4.6558755|-12.3409738|338.7550552 unknown
InChI: InChI=1/CHO.6Mo.3H2O.HO.17O.Pt/c1-2;;;;;;;;;;;;;;;;;;;;;;;;;;;;/h1H;;;;;;;3*1H2;1H;;;;;;;;;;;;;;;;;;/q;;;;3*+1;;;;;;;;;;;;;;;;;;;;;;/p-3/rCH5Mo6O22Pt/c8-1-30-7(20,21,22)25-3(11,12)23-2(9,10)24-5(14,15,16)26-4(13,28-30)27-6(17,18,19)29-30/h1,14,17,20,29H
charge -2 multiplicity 2
35 atoms
Pt -0.46959152 -1.44850964 -0.45930164
Mo 4.08135939 -0.00704699 0.18953016
Mo 1.7647147 2.3860696 -0.79150699
Mo -1.71571342 0.45246439 2.61842944
Mo -1.7162537 1.8244798 -1.34643387
Mo 1.8189986 -2.48812754 0.22936128
O  1.55722914 -0.33654344 0.30971377
O  5.73346267 0.02215612 -0.22474568
O  1.38561785 2.69137871 0.84724622
O  0.21167131 0.72635542 2.5267298
O  0.28171453 1.81894307 -1.69780166
O  3.63326868 -1.81896823 -0.03206709
O  -1.42885812 1.20487071 0.27030713
O  -3.66538493 1.21957632 -1.0746062
O  -1.14919418 -1.4150401 1.60390533
O  3.98618093 0.46169331 1.81802687
O  1.56123922 -3.06288367 1.8111822
O  1.80686973 -3.78612142 -0.87986782
H  0.46494854 1.60696324 2.20144901
H  -0.51242894 -1.88805414 2.15496226
Mo -3.80631513 -0.33873467 -0.12255042
O  -3.4381412 -0.06404852 1.63802943
O  -1.91725807 -0.30569194 4.1212651
O  -5.39396696 -0.94391148 -0.26289183
O  -2.6714189 -1.46838375 -0.87902818
O  -2.19498081 2.06914092 2.85634243
O  3.33161082 1.31095005 -0.96550844
O  -2.00057399 3.49007515 -1.36796703
O  2.20535431 3.88179549 -1.47395358
H  1.1355704 -0.04789832 1.15709925
C  0.13731949 -1.49384844 -2.31673014
O  -1.88080372 1.03961493 -3.06037265
O  -0.53077701 -1.34799444 -3.32125072
H  -1.61912812 0.10595067 -3.1971563
H  1.24465841 -1.64267117 -2.46483945
