program: Gaussian 16
title: Checking optimization
version: ES64L-G16RevA.03
frameworkgroup: C1[X(CH4Mo6O21Pt)]
method: RM06L
basis: def2TZVP
operation: Freq
keyword: #P
keyword: Geom=AllCheck
keyword: Guess=TCheck
keyword: SCRF=Check
keyword: GenChk
keyword: RM06L/def2TZVPFreq
converged: YES YES NO YES
title: Mulliken charges:
elementType: Pt Mo Mo Mo Mo Mo O O O O O O O O O O O O H H Mo O O O O O O O O H C O H
charge: 0.615958 1.828652 1.822693 1.405041 1.849754 1.352811 -0.770886 -0.660849 -0.624985 -0.785774 -0.808233 -0.804107 -0.605171 -0.809727 -0.746479 -0.631337 -0.593922 -0.623710 0.372971 0.371200 1.879608 -0.722892 -0.623431 -0.617865 -0.623529 -0.617263 -0.802267 -0.665353 -0.586544 0.384871 -0.135867 -0.371972 0.348603
chargesum: -2.00000
title: Mulliken charges with hydrogens summed into heavy atoms:
elementType: Pt Mo Mo Mo Mo Mo O O O O O O O O O O O O Mo O O O O O O O O C O
charge: 0.615958 1.828652 1.822693 1.405041 1.849754 1.352811 -0.386015 -0.660849 -0.624985 -0.412803 -0.808233 -0.804107 -0.605171 -0.809727 -0.375279 -0.631337 -0.593922 -0.623710 1.879608 -0.722892 -0.623431 -0.617865 -0.623529 -0.617263 -0.802267 -0.665353 -0.586544 -0.135867 -0.023369
polarizability: 5.00551183e+02 3.96397167e+00 3.55213779e+02 6.32364978e+00 -5.39588372e+00 2.95665976e+02
1716.lowfreq: -0.0002 0.0001 0.0005 0.8930 6.1626 7.0685 21.3397 28.4198 29.1487
frequency: 21.1153 28.3335 29.0303 40.4168 45.4352 51.8167 54.8942 68.8021 72.9921 78.9938 83.5058 88.3400 94.5229 99.2343 108.6087 117.0916 126.5400 143.1890 150.8248 153.9266 161.1478 165.9270 167.6472 181.4070 182.7288 191.7046 192.6924 195.8358 206.1491 210.0224 213.6567 217.7516 230.3998 234.9098 245.8729 252.6523 265.9450 271.3730 286.8583 302.1984 309.7453 321.8904 329.7245 335.9219 338.4923 348.2769 352.3433 354.1394 356.0500 361.8539 364.3188 371.5681 375.9736 387.9877 416.6225 434.4909 454.6200 475.9010 487.7912 512.9094 527.2230 531.5427 548.9765 575.4711 579.2308 638.2583 653.6308 692.7922 707.0746 721.5856 765.0378 778.5210 815.3090 858.2808 896.2462 934.2593 941.9702 944.1446 947.1068 951.0889 955.1706 961.0463 969.5728 976.1638 983.0267 986.6897 991.0073 1265.9846 1401.4945 3627.7236 3680.9421 3841.2862 3851.0871
redmass: 22.8226 24.5715 25.2996 23.4941 27.8884 28.7183 27.8422 15.4455 13.2677 16.8305 17.9241 15.0538 13.0009 15.6154 17.0319 18.2763 18.1674 13.5695 18.5372 23.2508 17.6737 14.6736 21.8694 18.2202 20.5361 23.4566 16.8299 16.6328 18.6162 14.9375 14.6865 13.1707 8.2716 15.0825 15.6312 12.6975 14.9175 10.2091 14.2873 14.0203 9.9772 13.8840 10.5431 10.8560 13.7504 9.5747 12.7935 11.2969 7.2782 17.4443 15.8453 10.5546 16.8481 12.9157 14.9714 10.7963 11.1840 10.3328 6.9728 1.3288 14.3964 6.5223 3.8013 1.4384 1.4013 1.1258 15.6620 11.2219 3.5829 1.2179 15.0494 1.3532 8.0404 10.4598 2.7300 2.0867 16.7618 13.8378 17.5384 12.7375 17.9746 16.3795 16.3946 15.8554 14.6679 15.8290 15.8725 1.6143 3.6868 1.0655 1.0664 1.0663 1.0662
irintensity: 0.7930 0.3721 0.8262 1.2635 0.6346 0.0982 0.3659 2.2970 1.5244 0.5617 0.8693 0.0147 1.3931 0.8461 0.2618 0.4128 1.2100 1.9234 1.9748 0.2137 3.6626 2.5509 2.3391 3.3289 2.3265 0.1873 1.6652 0.4656 0.7214 2.8993 22.1395 12.7513 7.0777 14.7520 6.9938 10.9838 14.8321 8.0323 1.4397 4.0020 29.9766 92.7586 24.5852 18.9675 4.3260 64.3875 17.3060 4.4654 20.9982 5.6384 26.4212 13.5117 39.6666 9.5877 27.6429 13.3808 25.7107 3.0091 23.8312 5.4512 74.9664 7.9864 110.0919 186.2955 4.3442 50.2680 52.9088 567.1675 15.4165 23.9006 1467.0330 24.3398 707.3421 259.9344 265.7236 58.3213 32.1532 207.1166 198.3442 215.7912 328.8115 163.3722 461.4384 170.4564 123.9425 130.1213 96.8890 243.9679 130.3986 41.3961 65.5279 50.6866 57.9044
temp: 298.150 k
press: 1.00000 atm
elementType: 78 42 42 42 42 42 8 8 8 8 8 8 8 8 8 8 8 8 1 1 42 8 8 8 8 8 8 8 8 1 6 8 1
symmnumber: 1
zpe: 318350.6 jmol-1
zpe.correction: 0.121253 hartree
zpe.thermalcorrener: 0.159215 hartree
zpe.thermalcorrenthalpy: 0.160159 hartree
zpe.thermalcorrgfe: 0.048411 hartree
zpe.sumelectzpe: -2150.804136 hartree
zpe.sumelectthermal: -2150.766174 hartree
zpe.sumelectthermalent: -2150.765230 hartree
zpe.sumelectthermalfe: -2150.876978 hartree
dipole: -0.0918 -2.4261 1.9464
dipole: 3.1118
quadrupole: -424.3352 -357.2037 -317.2252
quadrupole: 6.8464 -4.4385 -2.3566
quadrupole: -58.0805 9.0510 49.0295 6.8464 -4.4385 -2.3566
hfenergy: -2150.925389 hartree
pointgroup: C01 [X(C1H4Mo6O21Pt1)]
dipole: 0.0955151 -0.9310705 0.7891773 debye
polarizability: 498.6923727|16.8661256|356.8043083|-5.1489067|-7.5459611|295.9342578 unknown
InChI: InChI=1/CHO.6Mo.2H2O.HO.17O.Pt/c1-2;;;;;;;;;;;;;;;;;;;;;;;;;;;/h2H;;;;;;;2*1H2;1H;;;;;;;;;;;;;;;;;;/q;;;;;2*+1;;;;;;;;;;;;;;;;;;;;;/p-2/rCH4Mo6O21Pt/c8-1-5(15,16)24-4(13,14)26-6(17,18,19)25-2(9,10)23-3(11,12)27-7(20,21,22)28-29(1,5)7/h8,17,20,28H
charge -2 multiplicity 1
33 atoms
Pt 0.51758428 -0.8708487 0.03352136
Mo -4.26128088 -0.38100087 0.30981863
Mo -1.75512417 1.64453488 1.37801683
Mo 2.99590533 -1.77373436 0.54952631
Mo 0.8008586 2.71914001 -1.11408589
Mo -1.63870129 -2.00137376 -1.10089934
O  -2.00025609 0.57331192 -0.43317086
O  -5.52551214 -1.1534907 1.16054879
O  -2.63942298 3.04829846 1.74144266
O  2.33174321 -0.38020927 -1.1541278
O  -0.31464291 2.49089784 0.33967438
O  -3.53868124 -1.77200526 -0.73242423
O  0.22940938 1.68336899 -2.3490556
O  2.57307972 2.40333602 -0.70721025
O  2.23883928 0.33376601 1.09679804
O  -4.99299285 0.82437864 -0.64856086
O  -1.26440103 -1.14620994 -2.54895046
O  -1.38223408 -3.67455672 -1.29135288
H  2.36310205 -0.72867638 -2.04926914
H  2.13116933 0.50521897 2.03692616
Mo 3.97135754 1.10562883 -0.23841827
O  4.52250757 -0.70447523 0.33897374
O  2.92372973 -2.34229866 2.15646317
O  4.88498647 1.19365224 -1.66967398
O  4.80769912 2.02506015 0.91891682
O  3.16382844 -3.14066532 -0.45544851
O  -3.19745277 0.32158482 1.6892945
O  0.67379684 4.32942559 -1.67071715
O  -0.81906347 1.21468302 2.73353724
H  -1.62186703 0.92583987 -1.25558584
C  -0.93551012 -1.63876966 0.92036504
O  -1.05059473 -1.95869451 2.1778653
H  -1.96185911 -2.24311691 2.36126212
