program: Gaussian 16
title: Checking optimization
version: ES64L-G16RevA.03
frameworkgroup: C1[X(CH5Mo6O21Pt)]
method: UM06L
basis: def2TZVP
operation: Freq
keyword: #P
keyword: Geom=AllCheck
keyword: Guess=TCheck
keyword: SCRF=Check
keyword: GenChk
keyword: UM06L/def2TZVP
keyword: Freq
converged: YES YES NO YES
polarizability: 4.44837413e+02 -1.10893735e+00 3.50768124e+02 -3.66529465e+00 -2.05134396e+00 3.04362340e+02
1716.lowfreq: -3.9296 -0.0003 -0.0002 -0.0001 4.5121 6.8204 20.3029 28.7464 41.3977
frequency: 20.1813 28.6660 41.3918 44.9761 54.6575 67.3459 72.4515 76.0889 80.7873 88.2791 91.5258 98.3711 101.7197 103.6788 113.6192 120.3214 129.8783 132.6261 144.9625 162.0773 164.7886 168.6940 174.8564 177.1599 184.6737 192.6849 194.4537 194.8584 201.4323 207.6725 211.4982 215.7944 220.9264 231.9870 241.7696 258.6040 283.4022 291.5833 297.5963 302.9556 306.3199 311.6477 322.5755 331.1278 333.7736 342.9367 352.3283 356.5426 358.5398 367.7047 370.0487 381.1907 407.6475 420.0285 447.2045 460.3946 472.1194 483.0910 489.7589 507.5046 517.7695 524.2913 531.1819 581.0691 621.8037 640.2029 694.5889 718.6880 751.4782 763.3688 785.7363 788.5227 797.0060 849.9162 933.3759 937.6440 943.7886 954.0737 956.3821 964.6236 967.4612 972.5973 983.4044 987.0821 992.6851 995.5093 1019.9629 1092.1678 1168.7826 1269.7862 1525.3965 2974.1386 3078.8548 3475.4687 3763.0059 3788.3483
redmass: 23.0163 25.4978 27.9101 25.0516 24.9162 19.5018 27.7931 16.2925 22.4566 18.6599 17.2745 22.2315 17.9982 14.9455 10.2010 16.8364 17.6160 20.1890 22.4399 18.7262 21.5463 20.2803 16.1340 19.0887 9.1895 14.5177 17.9234 10.2631 11.5029 7.6187 13.7803 13.9379 8.0010 13.4419 20.5849 16.8857 8.6702 13.4062 12.5575 12.1935 15.1089 15.1521 14.9211 12.3542 9.8594 9.2896 12.6106 15.8691 15.3111 13.6191 15.7134 9.0562 10.4660 9.3068 10.5839 13.4563 9.4930 8.9399 10.6073 18.2225 10.3684 3.6647 1.9970 4.5710 10.2499 1.3132 7.8929 8.9377 1.9894 3.2721 2.8840 1.3313 14.5789 1.1785 2.1834 4.0290 10.6082 8.8971 6.5078 10.4891 7.5146 15.1425 15.6599 15.5529 4.0794 12.8949 1.4316 1.3340 1.2769 4.1764 1.1972 1.0500 1.1136 1.0663 1.0658 1.0659
irintensity: 0.0446 0.2538 0.0657 0.3229 0.6270 0.4296 0.4269 0.1990 1.2130 1.0185 0.0526 4.0650 0.3230 0.6368 1.8128 0.9004 0.2048 0.2204 1.7238 3.4154 0.0364 1.5904 3.2758 0.2065 2.5627 0.3805 5.7418 1.8190 0.9575 1.6771 22.0390 0.6572 7.4229 4.5260 5.3468 14.9349 15.9816 3.7378 121.4832 21.6926 37.1709 16.7551 18.8148 25.9765 7.9697 4.3262 2.9605 1.3581 7.3533 4.6845 3.2205 6.9773 3.6657 32.2693 8.4784 5.6042 6.1591 31.9277 127.4597 32.2545 67.2332 24.3340 193.9302 38.7639 38.4863 47.6378 655.4477 987.1376 374.5078 236.4204 514.4154 72.8590 219.6460 67.0017 127.4876 129.1286 131.3870 181.2103 209.5952 426.8960 214.0989 117.2300 20.4400 157.6078 121.9448 376.3230 70.7732 59.0894 1.1894 42.9597 3.0311 41.4698 11.5497 295.3581 47.1596 40.1533
temp: 298.150 k
press: 1.00000 atm
elementType: 78 42 42 42 42 42 8 8 8 8 8 8 8 8 8 8 8 8 1 1 42 8 8 8 8 8 8 8 8 1 6 8 1 1
symmnumber: 1
zpe: 348852.9 jmol-1
zpe.correction: 0.132871 hartree
zpe.thermalcorrener: 0.170377 hartree
zpe.thermalcorrenthalpy: 0.171322 hartree
zpe.thermalcorrgfe: 0.061060 hartree
zpe.sumelectzpe: -2151.445096 hartree
zpe.sumelectthermal: -2151.407590 hartree
zpe.sumelectthermalent: -2151.406646 hartree
zpe.sumelectthermalfe: -2151.516908 hartree
dipole: -1.6287 -1.1785 5.0232
dipole: 5.4106
quadrupole: -411.6134 -360.0050 -322.9134
quadrupole: 0.3045 -4.2681 -4.3317
quadrupole: -46.7695 4.8389 41.9305 0.3045 -4.2681 -4.3317
hfenergy: -2151.5779674 hartree
pointgroup: C01 [X(C1H5Mo6O21Pt1)]
dipole: -0.3916997 -0.761526 1.9488331 debye
polarizability: 441.7271317|1.3144948|350.3444449|-20.9872397|4.6996786|307.8962995 unknown
InChI: InChI=1/CH2O.6Mo.2H2O.HO.17O.Pt/c1-2;;;;;;;;;;;;;;;;;;;;;;;;;;;/h1H2;;;;;;;2*1H2;1H;;;;;;;;;;;;;;;;;;/q-1;;;;;2*+1;;;;;;;;;;;;;;;;;;;;;+1/p-2/rCH5Mo6O21Pt/c8-2(9)22-3(10,11)25-6(17,18)27-7(19,20,29(28-6)1-21-29)26-4(12,13)24-5(14,15,16)23-2/h14,19,28H,1H2
charge -2 multiplicity 2
34 atoms
Pt -0.65638339 -0.5404703 1.3402432
Mo -3.83922796 0.39746948 -0.30051647
Mo -1.2656065 2.62510774 0.40542415
Mo 1.48767345 -1.73376681 0.14576258
Mo 2.26629913 1.89405829 0.23926971
Mo -1.73465501 -2.2689617 -0.98677792
O  -1.27909242 -0.05844726 -0.63144504
O  -5.4254301 0.46387055 0.32051784
O  -1.21218366 3.06530642 -1.23119889
O  1.41506624 0.30589394 -1.08459984
O  0.29423915 1.72641123 0.89996891
O  -3.37257025 -1.38728726 -0.20463621
O  1.96908356 3.24904951 -0.73495158
O  3.9057368 1.22414253 -0.58397815
O  2.37903165 -0.21705814 1.22155447
O  -3.92666287 0.90267161 -1.92005293
O  -2.26697171 -2.51098238 -2.58443992
O  -1.94242039 -3.73278432 -0.13793379
H  1.45872146 0.39063013 -2.04617941
H  2.06144299 -0.17862546 2.13200457
Mo 3.99424949 -0.32386253 -1.64243123
O  3.16741163 -1.8109232 -0.90357174
O  1.67489139 -3.06649045 1.14750605
O  3.36072968 -0.01021353 -3.20727478
O  5.64707797 -0.7067661 -1.83194791
O  0.16237251 -2.2313537 -1.1720394
O  -2.89329767 1.70000927 0.76039009
O  2.87701739 2.50159572 1.70515962
O  -1.35019327 4.06858038 1.30486461
H  -0.43758906 0.18640106 -1.07316974
C  -1.05254988 -2.11379371 2.56746449
O  -0.32695028 -1.22568345 3.22261893
H  -0.58590826 -3.05411421 2.25514813
H  -2.12435179 -2.19261335 2.79924758
