program: Gaussian 16
title: Checking optimization
version: ES64L-G16RevA.03
frameworkgroup: C1[X(CH5Mo6O21Pt)]
method: UM06L
basis: def2TZVP
operation: Freq
keyword: #P
keyword: Geom=AllCheck
keyword: Guess=TCheck
keyword: SCRF=Check
keyword: GenChk
keyword: UM06L/def2TZVP
keyword: Freq
converged: YES YES NO YES
polarizability: 5.40980147e+02 -1.01681896e+01 3.66413721e+02 -1.04025045e+01 4.88460632e+00 3.01620796e+02
1716.lowfreq: -2.4802 -0.0005 -0.0005 -0.0002 3.7494 9.8222 20.2932 25.3123 27.6231
frequency: 20.2219 25.2504 27.6013 39.4187 41.7432 49.4292 56.5544 66.3678 73.4198 81.0331 85.4530 88.8604 101.9489 108.6079 111.6333 119.8962 133.3315 141.8411 150.8925 161.1798 165.0624 168.7615 175.2231 177.9526 179.6972 186.9239 192.0811 196.7041 200.3697 203.9630 214.3622 230.5921 238.5888 250.7462 252.6283 262.9034 271.3395 276.3530 285.7100 297.7693 301.1734 318.8548 323.9866 327.6641 334.0935 339.8323 343.7698 348.5414 355.6630 359.9417 363.8814 367.5602 374.7506 376.3093 384.5714 406.5951 412.1618 460.0249 480.9697 511.4919 521.2274 534.5633 555.4181 574.6011 613.0827 620.0062 657.9170 679.6708 689.7388 692.2960 783.3948 806.6848 826.8715 844.4228 857.5322 899.7322 926.8287 934.9810 944.3530 951.0986 954.2275 956.9549 969.5561 977.1150 979.8874 984.8006 990.4611 995.9592 1251.4745 1318.7634 1462.7365 2970.9689 3402.7388 3648.5438 3832.0554 3858.7180
redmass: 21.2953 25.2047 21.8829 30.2175 30.4392 22.9887 27.5377 19.3248 18.9451 18.1508 17.0360 17.7006 15.4292 19.2116 14.8100 18.1923 16.8978 16.5147 21.4187 19.3663 17.0954 12.8126 12.9687 23.7488 20.7448 15.7673 20.2260 17.5134 18.0949 16.2006 16.1883 16.1823 6.4973 6.7006 13.0971 12.8147 12.6010 5.1011 9.6110 16.7003 8.7179 12.7713 14.8520 12.5667 9.9012 9.4213 12.6936 9.6155 10.9129 7.6859 12.0555 11.3298 12.6885 8.5259 8.7524 8.0683 13.5329 9.1489 3.7578 16.3259 1.5016 5.0751 2.0560 2.7468 1.7245 4.8665 1.3429 2.9170 1.8967 3.0539 12.4368 8.1756 1.3539 7.4952 1.3866 10.1090 16.2601 5.4218 7.4878 16.8646 12.7997 6.1905 4.1407 16.8768 8.7392 14.0916 7.0096 4.6034 6.2530 1.0371 1.3865 1.0836 1.0637 1.0665 1.0664 1.0662
irintensity: 0.6941 1.1089 0.2168 0.3349 0.4081 0.1383 0.2853 0.2092 0.1514 0.4974 0.1866 0.8191 1.5763 1.4258 0.5292 2.2855 1.9776 0.1685 3.1183 0.1488 0.9240 0.5803 1.8671 2.8951 1.9358 1.2308 4.8509 6.8662 2.3078 1.3989 3.3550 13.8950 26.2815 8.7515 11.6520 8.3477 7.5844 1.4475 6.1383 9.6973 13.5052 27.4775 27.6742 13.9493 29.1084 9.0307 15.4240 16.2097 34.9468 35.7294 14.8518 13.4725 7.5457 18.2777 10.5946 17.9460 23.9577 49.6035 6.2214 28.5940 2.0557 18.1396 32.6640 151.5198 32.9948 105.1300 245.5398 225.7721 103.9084 337.8424 1703.1154 137.8755 81.5540 244.0156 77.1465 131.3744 156.5575 293.4034 133.7299 187.0739 190.0522 485.9111 167.9651 113.6902 60.7838 267.5244 156.9772 206.7324 489.0913 75.6713 27.2661 5.9303 626.7413 117.7277 52.2584 61.4682
temp: 298.150 k
press: 1.00000 atm
elementType: 78 42 42 42 42 42 8 8 8 8 8 8 8 8 8 8 8 8 1 1 42 8 8 8 8 8 8 8 8 1 6 8 1 1
symmnumber: 1
zpe: 347357.5 jmol-1
zpe.correction: 0.132301 hartree
zpe.thermalcorrener: 0.170403 hartree
zpe.thermalcorrenthalpy: 0.171348 hartree
zpe.thermalcorrgfe: 0.058627 hartree
zpe.sumelectzpe: -2151.398414 hartree
zpe.sumelectthermal: -2151.360312 hartree
zpe.sumelectthermalent: -2151.359368 hartree
zpe.sumelectthermalfe: -2151.472088 hartree
dipole: -0.9500 -0.3418 3.6335
dipole: 3.7711
quadrupole: -436.0628 -365.5596 -312.1849
quadrupole: 2.0328 -2.1197 3.8467
quadrupole: -64.7937 5.7095 59.0842 2.0328 -2.1197 3.8467
hfenergy: -2151.5307154 hartree
pointgroup: C01 [X(C1H5Mo6O21Pt1)]
dipole: -0.4204522 -0.276175 1.3957967 debye
polarizability: 535.1929321|-32.8326518|369.6631019|-9.030721|15.0122738|304.1586309 unknown
InChI: InChI=1/CH2O.6Mo.H2O.2HO.17O.Pt/c1-2;;;;;;;;;;;;;;;;;;;;;;;;;;;/h1-2H;;;;;;;1H2;2*1H;;;;;;;;;;;;;;;;;;/q;;;;;;+1;;;;;;;;;;;;;;;;;;;;;/p-1/rCH5Mo6O21Pt/c8-1-29-4(13,14)22-2(9,10)23-5(15,16,17)24-3(11,12)25-6(18,19)26-7(29,20,21,27-6)28-29/h1,8,15,26,28H
charge -2 multiplicity 2
34 atoms
Pt 0.46191067 -1.03977163 0.3946351
Mo -4.45918088 -0.29955814 -0.45137211
Mo -2.48660374 1.92787078 1.17821656
Mo 3.04983823 -2.40571839 0.17754317
Mo 0.74324178 2.56609448 -0.44066885
Mo -1.39445567 -1.76855773 -1.16971718
O  -2.22498618 0.76095179 -0.53455822
O  -5.90757106 -1.08548287 -0.01537079
O  -3.19761482 3.45850517 1.03846256
O  2.03549694 -0.73171197 -1.00355227
O  -0.62972448 2.3825026 0.821171
O  -3.22625906 -1.74112551 -0.6201309
O  0.19175247 1.84666646 -1.89480506
O  2.33924458 1.87088948 0.11326211
O  2.52013239 -0.50760184 1.35704359
O  -4.7922537 0.51238694 -1.9101736
O  -1.07021959 -1.00503485 -2.65004173
O  -1.05900862 -3.41702508 -1.38777824
H  1.84482872 -0.87132457 -1.93624502
H  2.72476426 -0.62707381 2.28792475
Mo 3.88849872 0.61922814 -0.10805387
O  4.51590696 -1.20503807 -0.16508486
O  3.30988492 -3.26970653 1.63597358
O  4.36593859 1.15750206 -1.64991923
O  4.96660581 1.32235448 1.00159766
O  2.87524787 -3.51131865 -1.11409486
O  -4.12621861 0.82538512 1.00167382
O  0.9640589 4.23307923 -0.73195644
O  -2.28867721 1.54204848 2.8527976
H  -1.61883278 1.10487902 -1.21330186
C  -0.82149058 -0.84003773 1.77392453
O  -0.43843156 -0.39763771 2.96535079
H  -1.91870152 -0.89740183 1.68319934
H  -1.16612174 0.16778271 3.31704893
