program: Gaussian 16
title: Checking optimization
version: ES64L-G16RevA.03
frameworkgroup: C1[X(CH6Mo6O21Pt)]
method: RM06L
basis: def2TZVP
operation: Freq
keyword: #P
keyword: Geom=AllCheck
keyword: Guess=TCheck
keyword: SCRF=Check
keyword: GenChk
keyword: RM06L/def2TZVPFreq
converged: YES YES NO YES
title: Mulliken charges:
elementType: Pt Mo Mo Mo Mo Mo O O O O O O O O O O O O H H Mo O O O O O O O O H O C H H H
charge: 0.602462 1.868669 1.797975 1.394488 1.828634 1.440952 -0.789003 -0.665688 -0.597789 -0.715881 -0.785121 -0.802660 -0.629718 -0.799405 -0.740113 -0.636074 -0.595378 -0.587608 0.393808 0.351750 1.849587 -0.722265 -0.628063 -0.612607 -0.631925 -0.607468 -0.786163 -0.652653 -0.592248 0.394588 -0.644995 0.109469 0.051607 0.077824 0.061011
chargesum: -2.00000
title: Mulliken charges with hydrogens summed into heavy atoms:
elementType: Pt Mo Mo Mo Mo Mo O O O O O O O O O O O O Mo O O O O O O O O O C
charge: 0.602462 1.868669 1.797975 1.394488 1.828634 1.440952 -0.394415 -0.665688 -0.597789 -0.322072 -0.785121 -0.802660 -0.629718 -0.799405 -0.388364 -0.636074 -0.595378 -0.587608 1.849587 -0.722265 -0.628063 -0.612607 -0.631925 -0.607468 -0.786163 -0.652653 -0.592248 -0.644995 0.299911
polarizability: 4.82019166e+02 -3.70156574e+00 3.49555829e+02 6.83278299e+00 7.23957010e+00 2.91647825e+02
1716.lowfreq: -6.2158 -3.1141 -0.0002 0.0002 0.0003 1.2654 21.9397 26.9248 42.1188
frequency: 21.9123 26.8617 42.1071 45.1613 47.9746 57.1160 65.3157 71.1314 79.5771 83.7953 91.5945 95.3828 100.2648 105.7660 113.1776 114.4964 122.2023 136.1178 150.8392 160.6798 162.7068 171.4357 182.1700 183.3040 188.0110 188.9446 195.4587 196.3342 198.4669 201.3690 208.1490 210.5542 226.4276 237.5027 244.2545 253.4786 259.0540 266.5014 279.5894 288.4430 296.5438 304.9366 317.4785 326.4293 330.8366 334.0563 342.8060 344.7650 351.6286 360.2860 363.1901 364.8222 367.7991 369.8303 371.9588 379.8156 401.9885 419.6415 447.4317 483.7400 495.8094 508.2039 515.2953 520.3523 539.2358 562.6516 568.7837 649.8497 669.5742 699.2378 775.6251 807.8644 835.5324 890.4105 893.3422 939.8142 942.1899 946.0022 948.2394 952.9141 956.3184 966.0684 975.3386 976.1781 981.0991 986.2070 992.5571 1076.9684 1177.6009 1193.4799 1462.7359 1476.0553 1483.9586 3000.9461 3095.6545 3101.1382 3741.6981 3825.4874 3848.8054
redmass: 21.7369 21.3924 24.0008 22.4378 21.3218 16.4765 21.9741 23.2784 15.8841 17.5422 12.0245 16.9150 16.0994 13.8298 5.9297 15.6478 3.8471 8.1288 14.4326 16.9977 21.4878 17.9117 13.7234 19.3220 7.7968 3.6111 3.3825 7.9293 8.5369 5.0815 12.4387 14.7335 15.8428 17.0800 7.4207 11.2604 15.2457 12.6725 7.8683 10.8486 7.9013 10.8658 9.4387 7.2856 8.6297 12.8803 7.9240 8.8844 11.5570 12.3774 12.0224 12.0755 10.9599 13.8514 7.8927 10.3317 11.6244 12.1836 11.7351 6.4082 1.9386 9.0526 2.1557 13.6060 2.5437 1.9347 1.6643 12.7052 1.2640 14.9398 14.6820 14.1353 15.1234 1.2043 1.2179 15.1390 16.1070 17.9799 9.4215 15.8072 18.7713 15.8205 16.5928 16.9318 13.3712 15.2699 16.6482 9.6154 1.3080 1.3378 1.1268 1.0437 1.0435 1.0285 1.1047 1.1066 1.0661 1.0664 1.0661
irintensity: 0.3440 0.1301 0.1610 0.6929 1.4572 1.0128 0.4685 0.5088 0.0496 0.1418 0.0969 0.6206 0.9312 0.6049 0.3496 0.8061 0.1021 0.3682 0.4150 1.7450 0.1953 1.1309 7.4139 0.9632 0.4849 0.5084 0.2012 0.9968 0.6253 1.1340 1.6467 7.8803 28.1363 3.9628 14.4541 21.4200 7.5335 15.3253 27.6444 31.8171 14.7961 8.1625 102.6370 29.4810 0.4367 12.3713 9.3776 26.0946 4.6416 6.0082 9.7007 2.7123 9.9067 9.8580 39.7980 13.6897 36.8716 10.7309 77.7031 24.9828 2.8420 51.8313 1.6003 15.6891 22.0760 236.6470 130.1775 10.7923 3.4043 620.3192 2177.1663 77.1125 327.4079 61.5707 42.8422 193.2901 3.5355 111.7781 30.9236 191.8852 477.0722 237.0194 304.8550 43.0074 392.0020 172.1499 87.5072 136.1778 0.3453 1.9435 7.2732 4.1248 2.4951 71.1371 15.3985 12.2150 57.5871 58.8838 48.2277
temp: 298.150 k
press: 1.00000 atm
elementType: 78 42 42 42 42 42 8 8 8 8 8 8 8 8 8 8 8 8 1 1 42 8 8 8 8 8 8 8 8 1 8 6 1 1 1
symmnumber: 1
zpe: 378814.5 jmol-1
zpe.correction: 0.144283 hartree
zpe.thermalcorrener: 0.182817 hartree
zpe.thermalcorrenthalpy: 0.183761 hartree
zpe.thermalcorrgfe: 0.071989 hartree
zpe.sumelectzpe: -2152.044148 hartree
zpe.sumelectthermal: -2152.005614 hartree
zpe.sumelectthermalent: -2152.004670 hartree
zpe.sumelectthermalfe: -2152.116442 hartree
dipole: -1.0958 -1.5539 -2.5574
dipole: 3.1868
quadrupole: -432.7676 -359.1933 -312.3771
quadrupole: -3.0674 -1.0595 1.1166
quadrupole: -64.6549 8.9193 55.7356 -3.0674 -1.0595 1.1166
hfenergy: -2152.1884311 hartree
pointgroup: C01 [X(C1H6Mo6O21Pt1)]
dipole: -0.3586086 -0.541653 -1.0723652 debye
polarizability: 481.3514198|7.6932613|347.7843219|9.463115|13.7477325|294.0870779 unknown
InChI: InChI=1/CH3O.6Mo.2H2O.HO.17O.Pt/c1-2;;;;;;;;;;;;;;;;;;;;;;;;;;;/h1H3;;;;;;;2*1H2;1H;;;;;;;;;;;;;;;;;;/q;;;;;2*+1;;;;;;;;;;;;;;;;;;;;;/p-2/rCH6Mo6O21Pt/c1-28-7(20,21)25-3(10,11)23-4(12,13,14)22-2(8,9)24-5(15,16,17)26-6(18,19)27-29(6,7)28/h12,15,27H,1H3
charge -2 multiplicity 1
35 atoms
Pt -0.24749921 -0.70613399 -0.27051579
Mo 4.59639208 0.24818026 0.35037026
Mo 1.95505613 1.92646462 -1.00470746
Mo -2.35323847 -2.25089807 -0.74994129
Mo -1.18494891 2.39662343 0.92944594
Mo 1.86856139 -1.75995813 0.75295465
O  2.01537791 0.64929555 0.77365338
O  6.17346373 -0.10816946 -0.19697252
O  2.41087549 3.52619226 -0.68965265
O  -1.95103043 -0.73655229 0.91234699
O  0.06696536 2.11839289 -0.40603486
O  3.77777566 -1.41720608 0.62465418
O  -0.60618246 1.61613406 2.34180778
O  -2.89737821 1.85918091 0.46258371
O  -2.30701604 -0.02776628 -1.3757679
O  4.7753403 1.16501743 1.77917465
O  1.47110494 -1.78655995 2.40774699
O  1.74221806 -3.35046488 0.16819038
H  -1.76819235 -1.05689191 1.80145524
H  -2.45628649 0.0359179 -2.32302551
Mo -4.01950136 0.29130554 0.07066534
O  -4.10394251 -1.61781313 -0.43255219
O  -2.22341245 -2.78227621 -2.36779227
O  -4.76651096 0.15102196 1.59425674
O  -5.17473097 0.96912967 -0.97334386
O  -2.12240499 -3.61019067 0.25027245
O  3.775681 1.17008774 -1.0412296
O  -1.26708455 4.06746323 1.26137192
O  1.62452321 1.81954089 -2.66962201
H  1.5753075 0.99562953 1.56335628
O  1.53919321 -0.74510624 -1.26962858
C  1.61980054 -1.36656907 -2.53306833
H  2.6552405 -1.29454749 -2.87900501
H  1.3295449 -2.41899884 -2.47994407
H  0.97875159 -0.84883074 -3.25102893
