program: Gaussian 16
title: Checking optimization
version: ES64L-G16RevA.03
frameworkgroup: C1[X(CH7Mo6O21Pt)]
method: UM06L
basis: def2TZVP
operation: Freq
keyword: #P
keyword: Geom=AllCheck
keyword: Guess=TCheck
keyword: SCRF=Check
keyword: GenChk
keyword: UM06L/def2TZVP
keyword: Freq
converged: YES YES NO NO
polarizability: 4.53167114e+02 -7.52783773e+00 3.61553664e+02 -2.71400314e-01 2.40045885e+00 3.19374946e+02
1716.lowfreq: -0.4599 0.0004 0.0005 0.0006 1.4218 4.3506 26.1301 34.9758 42.2613
frequency: 26.1072 34.9510 42.2311 43.1492 51.1349 58.4558 64.8442 69.0489 72.5405 81.2260 86.8224 90.4217 96.0613 103.2020 108.8820 114.3318 123.0846 129.2687 145.0065 153.5062 156.6109 164.9495 171.6947 175.9133 183.0879 188.5407 193.5991 195.8936 200.4313 202.7801 207.4304 212.8866 220.4286 231.6587 231.7644 237.4660 252.4219 263.7653 277.9346 285.6838 290.4265 296.5762 301.6945 305.5224 315.9646 323.7643 332.9313 335.2787 346.5455 350.1418 351.8904 360.2191 365.3371 369.7133 387.1161 400.8800 406.8011 445.1731 460.6938 476.9463 486.4908 501.0464 512.8927 519.3240 525.8214 615.0328 637.6629 694.0476 716.9082 777.4977 787.8724 800.1988 846.1136 860.7467 884.1179 900.9452 924.7732 932.9988 934.7724 937.5922 948.4882 954.4176 959.4342 963.1384 971.9983 981.0124 987.0574 1019.7283 1113.4822 1140.2416 1182.9579 1434.8995 1468.1074 1483.7400 1494.5744 3025.8069 3122.8951 3168.7441 3329.5111 3394.1318 3757.3667 3759.4595
redmass: 21.2937 15.1250 19.9898 12.6889 9.0384 13.7497 17.4448 9.7550 5.7605 17.9941 8.1996 16.1517 15.7788 24.4242 13.7739 18.7883 19.2352 12.5195 17.4140 7.0157 2.3878 13.0408 4.7184 14.1876 19.5155 9.4105 13.1165 14.8892 15.4208 8.7648 11.1904 3.8764 8.0848 17.6663 13.5367 9.2885 9.7008 12.6491 9.8816 10.6441 15.5841 12.5636 13.9153 11.0933 15.4210 13.0983 8.5796 15.2953 14.1592 16.1991 11.4691 15.5816 14.4778 11.8611 6.8852 10.2329 7.8494 14.8086 9.1011 8.6809 11.1498 12.4342 3.2107 2.3556 10.0142 13.2465 1.1966 13.1296 13.5904 8.0723 1.2518 12.3580 9.7486 1.3355 1.1642 1.2409 5.1958 10.3525 15.5659 13.1571 15.4396 13.9064 16.4091 17.2190 15.0361 17.1477 13.8653 7.3241 1.0666 1.1596 1.2921 1.1583 1.1376 1.0417 1.0382 1.0325 1.1079 1.1041 1.0697 1.0672 1.0660 1.0656
irintensity: 0.5010 0.3613 0.0775 0.8524 0.8788 0.3921 1.0559 0.8680 0.7219 0.1059 1.7563 0.1690 0.5081 0.9850 0.4263 0.7078 0.0870 1.2678 0.3373 1.0599 0.8271 0.5824 1.1986 3.0937 0.5199 1.8687 2.2006 3.9320 8.7903 9.3748 1.0922 2.3859 6.1909 11.8927 2.9049 6.1081 9.3854 6.6762 3.6215 86.6993 12.2956 10.3510 41.0806 60.2571 19.6520 29.5776 1.0953 39.0705 10.2657 8.7263 1.2516 11.1028 5.9909 4.9125 25.4143 14.2256 15.0258 15.1661 21.0611 59.1803 12.1169 99.1321 75.3497 79.1206 134.8581 141.7864 7.0267 309.1130 899.9748 1454.3532 117.0370 371.2279 172.4975 218.6585 143.7807 60.2341 53.8181 30.5978 61.8248 423.1983 224.2869 516.0838 262.6681 280.1718 61.9767 125.0898 184.4238 109.6220 53.0229 27.1357 1.1968 20.4109 2.6166 6.7381 14.4341 107.2997 19.5809 9.6326 253.1262 421.5948 1.9810 62.7927
temp: 298.150 k
press: 1.00000 atm
elementType: 78 42 42 42 42 42 8 8 8 8 8 8 8 8 8 8 8 8 1 1 42 8 8 8 8 8 8 8 8 1 6 8 1 1 1 1
symmnumber: 1
zpe: 410503.8 jmol-1
zpe.correction: 0.156353 hartree
zpe.thermalcorrener: 0.195128 hartree
zpe.thermalcorrenthalpy: 0.196073 hartree
zpe.thermalcorrgfe: 0.083149 hartree
zpe.sumelectzpe: -2152.621279 hartree
zpe.sumelectthermal: -2152.582503 hartree
zpe.sumelectthermalent: -2152.581559 hartree
zpe.sumelectthermalfe: -2152.694483 hartree
dipole: -3.6791 -2.4741 7.6176
dipole: 8.8139
quadrupole: -413.8101 -366.3438 -316.0180
quadrupole: 5.9366 -12.0297 -13.5572
quadrupole: -48.4194 -0.9531 49.3726 5.9366 -12.0297 -13.5572
hfenergy: -2152.7776317 hartree
pointgroup: C01 [X(C1H7Mo6O21Pt1)]
dipole: -1.2686026 -1.0022666 3.0676912 debye
polarizability: 453.0362312|-5.5193758|361.2852996|-7.318609|2.6804233|319.7741921 unknown
InChI: InChI=1/CH4O.6Mo.2H2O.HO.17O.Pt/c1-2;;;;;;;;;;;;;;;;;;;;;;;;;;;/h2H,1H3;;;;;;;2*1H2;1H;;;;;;;;;;;;;;;;;;/q;;;;;2*+1;;;;;;;;;;;;;;;;;;;;;/p-2/rCH7Mo6O21Pt/c1-21-29-6(17,18)25-4(12,13)24-5(14,15,16)23-2(8,9)22-3(10,11)26-7(29,19,20,27-6)28-29/h14,17,21,28H,1H3
charge -2 multiplicity 2
36 atoms
Pt -1.06235587 -0.36609776 1.1245682
Mo -3.45409747 0.33538443 -1.23504307
Mo -1.31598051 2.80002737 0.48833326
Mo 1.37752439 -1.28368979 0.7884356
Mo 2.30865615 2.1185546 -0.49088403
Mo -1.43307051 -2.44408428 -0.82270624
O  -1.11172891 -0.16286366 -0.92102526
O  -5.13423702 0.52891448 -1.01039402
O  -1.59783465 4.45057926 0.15799402
O  1.55210915 0.10212464 -1.09724134
O  0.31592947 2.34175896 -0.18589137
O  -3.19550325 -1.44555029 -0.74209615
O  2.35121562 2.8185087 -2.03497909
O  4.02186918 1.15205806 -0.56316519
O  2.02327186 0.61411278 1.31848474
O  -3.17282328 0.55048431 -2.89838732
O  -1.51608609 -2.98504392 -2.43758329
O  -1.90808471 -3.7240032 0.20627025
H  1.71830827 -0.25981884 -1.97803336
H  1.37906268 1.04213368 1.89821877
Mo 4.2366456 -0.65662081 -0.9521764
O  3.23826514 -1.69789484 0.20443031
O  1.33766708 -2.0298188 2.32946168
O  3.8132406 -0.9879556 -2.5843524
O  5.88705966 -1.05390506 -0.74421853
O  0.45877728 -2.38975759 -0.5005599
O  -2.78883685 1.85500936 -0.23255192
O  2.7630799 3.33905557 0.60259628
O  -1.30189745 2.61858223 2.19409658
H  -0.22309797 0.16908365 -1.18280971
C  -1.92091697 -1.98846922 3.44731141
O  -0.97846707 -0.93704948 3.17917727
H  -1.80945074 -2.80831462 2.73509147
H  -1.77923235 -2.343924 4.4700245
H  -0.08166812 -1.35170434 3.16795625
H  -2.91531221 -1.56280599 3.34664799
