program: Gaussian 16
title: Checking optimization
version: ES64L-G16RevA.03
frameworkgroup: C1[X(H4Mo6O20Pt)]
method: UM06L
basis: def2TZVP
operation: Freq
keyword: #P
keyword: Geom=AllCheck
keyword: Guess=TCheck
keyword: SCRF=Check
keyword: GenChk
keyword: UM06L/def2TZVPFreq
converged: YES YES NO NO
polarizability: 4.77819145e+02 2.44806022e+01 4.57170302e+02 7.31433719e+00 9.22749123e+00 2.62744677e+02
1716.lowfreq: -6.2434 -3.4227 -0.0004 -0.0002 0.0003 1.1906 13.5859 15.3172 26.9083
frequency: 12.8293 14.8244 26.8893 31.4275 38.1350 43.5412 52.9981 60.5790 67.2928 75.8882 82.6210 86.7888 104.0643 106.2278 113.0121 119.1268 122.7677 132.8722 137.1301 143.8596 162.0558 165.1094 173.2774 177.7334 187.7978 191.4567 196.2664 202.4152 206.9482 212.6658 226.4380 239.7668 241.2783 248.6871 266.2966 274.3542 280.1965 298.3808 305.8297 312.4590 314.6186 318.3542 325.2535 332.4708 337.0904 339.5469 350.2737 357.8101 363.1504 368.4436 376.1398 378.4101 418.1126 424.4703 450.8720 509.1020 524.7480 541.7723 573.8066 606.6703 630.2071 649.5567 657.5922 671.1485 680.0349 736.9804 755.6030 777.1468 794.8484 868.8115 895.4016 927.7535 933.8018 944.3315 946.4753 948.4172 955.7485 962.4589 972.5596 973.9307 981.1629 991.3892 998.4101 2073.9633 3758.6207 3779.8443 3819.8931
redmass: 23.6735 25.3748 27.8835 20.3037 28.2027 23.4207 27.6552 23.5672 34.0559 21.6709 18.7884 33.4860 17.7954 19.9298 19.8075 13.2941 16.0991 16.7477 14.5023 20.4156 13.7247 15.8836 14.5474 17.7178 17.6473 14.5294 15.9046 13.3316 17.6864 20.7260 14.5913 14.4122 11.1575 16.7443 8.9044 11.1298 11.4225 13.8786 8.5843 17.2956 11.1166 11.8038 13.9931 14.7413 10.1782 14.9270 10.0097 11.2908 13.8426 9.9186 16.6090 15.2908 8.1559 22.9515 18.9384 6.7672 6.9039 1.7088 8.0240 1.4683 4.3952 1.1106 1.7216 2.2155 1.3384 15.4675 3.4719 2.0086 3.3938 1.0892 2.8967 2.1537 16.8930 10.1534 13.4587 15.0239 14.9877 17.5999 7.0141 16.6193 16.1674 16.3267 16.2031 1.0125 1.0647 1.0658 1.0662
irintensity: 0.1585 0.3676 0.5720 0.5183 0.2723 0.2894 0.6616 0.4025 0.3733 1.5200 0.4111 0.7388 0.1548 0.2254 1.0651 2.4896 1.7437 1.7253 1.1846 0.4782 1.4933 1.7916 2.9934 3.0490 1.5847 1.5131 4.8052 3.0847 5.0068 6.8497 2.3710 8.1557 3.6660 2.2338 26.9287 23.9483 43.9031 7.7407 17.8066 26.7217 22.4355 12.4918 2.1216 16.1751 32.8900 17.1724 7.3225 6.6465 2.7518 11.2736 4.3615 33.9984 9.2763 20.7110 38.8447 32.5082 17.9894 148.0257 68.6748 125.3963 76.8888 26.5341 74.8599 333.6509 143.1025 746.0429 132.1596 88.0221 353.1719 22.6518 145.0604 111.6563 265.4119 133.4218 13.2865 749.4864 209.8101 265.4012 211.2012 284.3339 91.8600 316.7929 152.6324 51.4690 35.9520 45.4789 40.2933
temp: 298.150 k
press: 1.00000 atm
elementType: 78 42 42 42 42 42 8 8 8 8 8 8 8 8 8 8 8 8 1 1 42 8 8 8 8 8 8 8 8 1 1
symmnumber: 1
zpe: 283751.2 jmol-1
zpe.correction: 0.108075 hartree
zpe.thermalcorrener: 0.144736 hartree
zpe.thermalcorrenthalpy: 0.145680 hartree
zpe.thermalcorrgfe: 0.033253 hartree
zpe.sumelectzpe: -2037.448398 hartree
zpe.sumelectthermal: -2037.411737 hartree
zpe.sumelectthermalent: -2037.410793 hartree
zpe.sumelectthermalfe: -2037.523219 hartree
dipole: -1.2844 0.5723 -4.0396
dipole: 4.2774
quadrupole: -403.2606 -380.6373 -297.2563
quadrupole: 5.7338 3.1613 2.2586
quadrupole: -42.8758 -20.2526 63.1284 5.7338 3.1613 2.2586
hfenergy: -2037.5564728 hartree
pointgroup: C01[X(H4Mo6O20Pt1)]
dipole: -0.5070974 0.2223823 -1.5891494 debye
polarizability: 477.1403613|24.7252201|457.7884302|7.4194834|9.8461485|262.8053329 unknown
InChI: InChI=1/6Mo.3H2O.17O.Pt.H/h;;;;;;3*1H2;;;;;;;;;;;;;;;;;;;/q;;;;;+1;;;;;;;;;;;;;;;;;;;;;+2;/p-3/rH4Mo6O20Pt/c7-1(8,9)22-2(10,11)23-3(12,13)24-4(14,15)25-5(16,17)26-6(18,19)27(20)21/h7,20-21,27H
charge -2 multiplicity 3
31 atoms
Pt 0.08564069 -0.28912071 -0.63034869
Mo 4.19791181 -0.78117231 0.12314617
Mo 2.28036594 2.28122119 0.44848311
Mo -2.76906266 -2.49960238 0.29221844
Mo -1.02215581 3.27161352 -0.47658025
Mo 1.04353199 -2.76355442 -0.15103282
O  5.27719253 -1.18310309 -1.14541855
O  1.69849486 1.82214188 1.98484133
O  -0.89848273 1.11284632 0.68872784
O  0.85882498 2.80866139 -0.66118589
O  2.71725724 -1.91045776 0.18592328
O  -1.19374668 -3.16525907 -0.7334363
O  -1.24704502 4.0914046 0.99107609
O  -2.52217194 2.21203589 -0.86275569
O  -2.12235283 -0.59654712 -1.09526422
O  4.98847257 -0.71315682 1.64084977
O  0.62044823 -3.46646938 1.34795649
O  1.39645942 -3.86126611 -1.42443497
H  -0.49470195 1.13750068 1.56533788
H  -2.33434173 -0.42602086 -2.01868599
Mo -3.20702807 0.84624198 0.39416862
O  -2.90682903 -0.91345973 1.26030043
O  -4.14272076 -2.72454731 -0.68084808
O  -3.53012777 1.76481435 1.78349943
O  -4.70642069 0.58336415 -0.36110824
O  -2.83570547 -3.69142917 1.49543742
O  3.29416021 0.90260355 -0.27948867
O  -1.13276021 4.44717133 -1.70472208
O  3.30699494 3.62972421 0.65656937
H  -1.20655207 -2.75343195 -1.60910604
H  0.77056598 -1.16891985 -1.77552821
