program: Gaussian 16
title: Checking optimization
version: ES64L-G16RevA.03
frameworkgroup: C1[X(H8Mo6O22Pt)]
method: UM06L
basis: def2TZVP
operation: Freq
keyword: #P
keyword: Geom=AllCheck
keyword: Guess=TCheck
keyword: SCRF=Check
keyword: GenChk
keyword: UM06L/def2TZVPFreq
converged: YES YES NO YES
polarizability: 4.57743611e+02 7.44843191e+00 4.10491445e+02 -9.63740412e+00 -3.18135004e+00 2.86712529e+02
1716.lowfreq: -9.3109 -6.6934 -2.3435 0.0003 0.0003 0.0004 17.2914 19.7362 26.8471
frequency: 17.2368 19.6680 26.7468 32.7703 41.1320 53.3160 54.8956 62.4325 74.1326 81.6149 82.4702 89.0805 101.3325 102.5298 107.2842 114.6195 123.9489 131.7445 134.1787 139.4038 144.0736 147.8480 155.0554 165.7035 170.0452 178.6991 180.6719 190.2737 192.3920 197.0502 201.1187 205.4278 207.9844 214.8885 219.5061 227.5830 229.9471 243.7683 254.4684 261.3654 263.2993 288.3598 306.0416 308.7044 316.1622 321.2471 322.0304 333.0021 335.6350 346.8956 348.1113 351.5797 361.7281 366.4982 369.1065 380.5840 390.9065 413.6290 427.2526 433.7805 435.8506 443.0625 450.2993 452.6975 468.9741 472.4671 491.7179 505.5540 534.4913 555.7764 601.4669 623.5950 632.7548 649.5738 673.0800 702.6793 749.3372 781.9826 795.9932 798.7986 806.5262 817.0142 828.6735 857.3103 926.0705 928.9389 935.0977 939.6009 953.2455 956.5927 960.0015 971.0883 976.0537 986.3369 994.0411 1637.3094 1710.2779 2207.7838 3560.9282 3693.7353 3720.0693 3760.5904 3803.0578 3816.5768 3831.9464
redmass: 10.9988 19.4375 19.2587 24.6520 21.4221 26.3201 26.1348 24.4583 22.4393 23.5810 15.6832 16.3810 10.9571 16.7012 12.6499 12.7427 13.7055 10.6193 15.6884 15.1286 14.0374 10.2718 11.4511 16.3273 13.5313 12.4227 10.4673 10.5019 15.3848 13.9249 15.9356 14.0344 11.6699 14.4871 10.0844 15.1289 10.9882 15.2743 18.1962 9.6719 7.0033 10.5746 11.6424 9.5164 12.1625 11.7190 11.8919 12.4305 8.2379 7.7049 6.7670 10.1636 11.0202 11.9217 12.8941 10.9551 6.5104 13.2055 1.0509 4.2308 4.7047 1.0856 1.5118 1.8525 4.9120 7.7541 1.2663 5.2784 6.6266 1.0847 1.4953 1.0582 1.1316 1.2116 6.0503 1.1491 7.8092 3.3469 2.6984 2.7775 6.6217 1.3990 5.9862 1.4208 16.1333 17.0948 7.8637 17.5330 16.0329 17.5551 18.3543 16.8772 17.3532 16.0057 17.1654 1.0745 1.0756 1.0126 1.0540 1.0470 1.0771 1.0808 1.0658 1.0664 1.0657
irintensity: 2.1810 1.1029 0.1515 0.0852 0.2886 1.2859 0.7021 0.2387 0.1076 0.3310 0.5978 0.1136 0.6717 0.0638 0.6954 2.2912 0.0529 1.4536 2.2378 3.8237 3.4488 6.0899 0.2346 0.7426 1.7630 2.7389 0.3853 1.5599 0.2478 2.5333 3.1474 1.3978 0.2493 2.1021 0.6764 6.7295 1.3282 11.6172 23.7569 3.5210 39.8014 11.1415 28.3862 7.7450 3.1449 10.2378 21.2466 6.7141 22.2502 46.2278 3.0437 55.3617 0.4205 20.4567 8.7670 49.3095 7.1217 21.5126 40.9153 45.1483 51.6201 6.6187 4.5274 85.1785 67.2075 25.6718 24.6492 110.6024 97.0778 135.8970 63.1021 2.0513 1.0008 2.9543 216.7170 29.5396 1377.6868 657.1689 35.1420 473.1765 187.1323 31.7809 281.1471 132.6098 87.2527 166.8215 71.2355 218.3157 159.1210 388.2474 493.1358 228.5335 221.1498 229.8632 92.9790 118.2410 181.7942 119.0505 145.8652 426.7445 182.0828 75.7695 26.6043 47.5877 38.0459
temp: 298.150 k
press: 1.00000 atm
elementType: 78 42 42 42 42 42 8 8 8 8 8 8 8 8 8 8 8 8 8 8 1 1 1 42 8 8 8 8 8 8 8 8 1 1 1 1 1
symmnumber: 1
zpe: 418465.6 jmol-1
zpe.correction: 0.159385 hartree
zpe.thermalcorrener: 0.200655 hartree
zpe.thermalcorrenthalpy: 0.201599 hartree
zpe.thermalcorrgfe: 0.082004 hartree
zpe.sumelectzpe: -2190.336936 hartree
zpe.sumelectthermal: -2190.295666 hartree
zpe.sumelectthermalent: -2190.294722 hartree
zpe.sumelectthermalfe: -2190.414317 hartree
dipole: -0.7225 -3.2428 -2.5516
dipole: 4.1891
quadrupole: -408.9278 -416.9974 -308.0912
quadrupole: 13.9183 -12.0095 -1.4396
quadrupole: -30.9224 -38.9919 69.9143 13.9183 -12.0095 -1.4396
hfenergy: -2190.4963211 hartree
pointgroup: C01 [X(H8Mo6O22Pt1)]
dipole: -0.360365 1.2599549 0.9994595 debye
polarizability: 458.481529|-4.5057641|409.7440769|9.7305449|-3.0404247|286.7219794 unknown
InChI: InChI=1/6Mo.4H2O.HO.17O.Pt.H/h;;;;;;4*1H2;1H;;;;;;;;;;;;;;;;;;;/q;;;;;;;;;;;;;;;;;;;;;;;;;;;;+2;/p-2/rH4Mo6O20Pt.2H2O/c7-1(8)20-2(9,10)22-4(13,14)24-6(17,27(18)19)25-5(15,16,26-6)23-3(11,12)21-1;;/h18-19,25,27H;2*1H2
charge -2 multiplicity 3
37 atoms
Pt 0.06468479 -0.10392927 1.16462724
Mo -2.94127202 -1.88725756 -1.11815671
Mo -3.27639738 1.22638888 0.6464035
Mo 3.52270267 -1.41487517 -0.18353762
Mo -0.34507704 3.27444846 -0.16939558
Mo 0.4682449 -2.46355884 0.21990571
O  -2.25870287 0.98276153 -1.69313072
O  -2.33483832 -5.72363343 0.35434471
O  -3.72550804 -3.37676357 -0.79400463
O  -4.46017012 2.15993421 -0.1339435
O  0.53553285 1.00530153 -0.70350424
O  -1.64291023 2.17120006 0.72901442
O  -1.15504924 -2.06801734 -0.92121043
O  2.36632869 -2.50216066 1.21295811
O  -0.66080648 3.30446533 -1.8603167
O  1.41385184 3.11779826 0.31706211
O  2.18902732 0.41123268 1.11836816
O  -3.34920609 -1.36091022 -2.70799792
O  1.68505127 -2.18176584 -1.07889441
O  -0.02361607 -3.98904668 0.81774678
H  0.23639202 0.52290456 -1.48277149
H  -2.88924071 -5.02427239 -0.01884726
H  2.67104952 0.49918574 1.94732188
Mo 2.69541795 1.84875284 -0.63333784
O  3.32760213 0.11639081 -1.24636425
O  4.53819706 -0.98161346 1.12882659
O  2.66413801 2.62950497 -2.14147614
O  4.06737143 2.42296177 0.1887785
O  4.4809157 -2.48326818 -1.0857433
O  -3.50313983 -0.60909481 0.1576115
O  -0.75683178 4.82243227 0.4086334
O  -3.74847754 1.18931321 2.27331047
H  -2.73441313 0.57283109 -2.43094798
H  -1.51124673 -5.25724756 0.560462
H  2.46790288 -2.1494763 2.10207723
H  -0.23401441 -0.85092915 2.52141155
H  -1.75124301 1.7448042 -2.02900515
