program: Gaussian 16
title: Checking optimization
version: ES64L-G16RevA.03
frameworkgroup: C1[X(H8Mo6O22Pt)]
method: UM06L
basis: def2TZVP
operation: Freq
keyword: #P
keyword: Geom=AllCheck
keyword: Guess=TCheck
keyword: SCRF=Check
keyword: GenChk
keyword: UM06L/def2TZVPFreq
converged: YES YES NO YES
polarizability: 4.20620157e+02 -4.12665118e+00 3.93539307e+02 3.69030942e+00 -1.66429346e-02 3.11781090e+02
1716.lowfreq: -2.5073 0.0004 0.0006 0.0006 1.3578 3.9359 21.3145 25.1908 29.0679
frequency: 21.2993 25.1853 29.0655 36.6915 40.8477 49.2499 60.7987 64.1802 72.4456 85.7097 86.9186 96.4573 99.8429 102.1101 109.5335 111.5517 123.2954 131.5409 134.8765 142.0550 150.0997 155.9221 165.8727 167.4723 173.6242 185.8125 190.9294 193.4343 199.5651 204.4975 206.8224 210.9117 215.4558 217.9129 230.5593 236.5845 245.0621 253.2687 263.8952 270.4591 291.1302 297.6552 299.9346 304.0972 319.4707 321.0988 333.2351 340.5866 353.1943 354.6722 356.0031 362.8691 372.4772 373.4660 379.7257 385.2685 395.7913 407.8362 422.1285 436.2465 447.8374 455.1578 460.1971 464.7595 469.7764 481.2937 484.9485 528.2249 570.1996 577.9746 597.2748 623.9245 652.8483 659.4324 710.2460 712.1571 749.5754 762.9645 774.8140 821.1700 855.5412 876.0255 904.2178 926.4855 936.4920 939.7693 947.9643 950.4332 952.3851 972.7284 974.3388 977.6981 983.9188 988.1142 1044.2262 1614.8818 1681.7301 2239.6506 3352.3174 3618.4895 3704.8748 3789.2150 3790.1788 3814.5778 3829.8253
redmass: 19.1493 11.4578 22.3887 22.9699 23.4803 24.1432 22.2181 19.1915 24.7575 21.0801 15.2874 8.8477 14.2430 19.7333 18.8915 9.3459 14.3943 11.0794 13.6709 15.1872 10.9938 14.1427 12.5306 13.6855 12.3153 16.7980 18.6059 15.2071 16.3958 12.3934 13.8420 9.5032 14.1380 11.6474 13.1082 8.1860 14.3456 13.6488 14.3135 8.1570 9.9003 12.5170 13.7026 10.7618 15.0401 10.4707 12.7918 12.5711 11.1310 11.4427 11.5011 12.9180 13.7548 10.4618 8.1092 9.9792 5.9381 1.0814 6.2896 4.9419 1.1028 2.4603 1.9536 4.2297 2.1448 1.3473 2.3264 7.0690 1.4253 4.0429 1.6119 7.4959 1.1567 1.1176 1.1466 8.9903 10.7781 8.2905 1.1643 14.6412 1.3834 11.1505 1.1931 9.2881 7.1558 14.6961 16.8487 14.4093 16.2300 15.5958 16.1722 14.9267 15.7194 16.2536 1.1083 1.0724 1.0755 1.0126 1.0632 1.0660 1.0459 1.0811 1.0696 1.0662 1.0656
irintensity: 1.1717 2.4224 0.0139 0.2629 0.7401 0.1980 0.5109 0.5193 0.4769 1.0977 2.0516 0.8953 0.0893 0.9532 0.1809 0.3422 1.6253 1.8929 0.6248 1.1166 0.6242 4.8104 0.0052 1.2196 6.7999 0.3457 2.1667 2.2411 0.9691 0.5012 7.0209 2.4702 3.0503 2.6142 9.2914 3.0642 52.7638 3.8602 15.3903 18.4100 29.6341 0.4903 16.6993 1.5150 12.4693 6.7389 49.4145 46.6314 1.8976 17.7707 9.3416 2.5490 27.9338 5.0102 68.7960 26.9189 4.8282 46.0607 8.8904 61.5674 18.0055 97.9432 25.7572 11.5295 88.8538 105.3506 22.8078 48.4368 20.9864 199.0784 94.1114 277.6286 4.0755 0.2955 21.3216 379.5852 619.0208 658.0494 21.5314 671.4789 55.9544 756.5912 63.5554 25.5455 301.5619 59.4920 396.5415 199.1453 411.8074 80.4992 253.7798 410.5663 102.3914 30.7136 65.3735 79.6932 109.4337 170.3385 303.3191 333.0696 271.6564 49.4647 122.0825 46.2705 40.7835
temp: 298.150 k
press: 1.00000 atm
elementType: 78 42 42 42 42 42 8 8 8 8 8 8 8 8 8 8 8 8 8 8 1 1 1 42 8 8 8 8 8 8 8 8 1 1 1 1 1
symmnumber: 1
zpe: 421920.3 jmol-1
zpe.correction: 0.160701 hartree
zpe.thermalcorrener: 0.201330 hartree
zpe.thermalcorrenthalpy: 0.202274 hartree
zpe.thermalcorrgfe: 0.084691 hartree
zpe.sumelectzpe: -2190.341815 hartree
zpe.sumelectthermal: -2190.301186 hartree
zpe.sumelectthermalent: -2190.300242 hartree
zpe.sumelectthermalfe: -2190.417825 hartree
dipole: -3.4871 -1.2397 2.8337
dipole: 4.6612
quadrupole: -383.8188 -409.2792 -327.0600
quadrupole: -7.3384 -18.0794 -6.6588
quadrupole: -10.4328 -35.8932 46.3260 -7.3384 -18.0794 -6.6588
hfenergy: -2190.502516 hartree
pointgroup: C01 [X(H8Mo6O22Pt1)]
dipole: -1.3228876 0.4393212 -1.1916269 debye
polarizability: 420.3315282|5.1345128|393.8898217|2.599979|0.4199911|311.7192038 unknown
InChI: InChI=1/6Mo.2H2O.3HO.17O.Pt.H/h;;;;;;2*1H2;3*1H;;;;;;;;;;;;;;;;;;;/rH4Mo6O20Pt.2H2O/c7-1(8)18-2(9,10)20-6(17)23-4(13,14,24-6)22-5(15,16)21-3(11,12,19-1)25-27(6)26-5;;/h23,25-27H;2*1H2
charge -2 multiplicity 3
37 atoms
Pt -0.86826032 -0.30779751 -1.91858912
Mo 2.73205655 -2.14681155 0.54991954
Mo 3.42130596 1.34263214 1.10710014
Mo -3.17677727 -0.90040694 1.29397975
Mo 0.66414307 2.83767787 -1.06477662
Mo -0.85834502 -2.43260627 -0.46537947
O  1.1088972 -0.46622218 1.84455397
O  1.87489585 -5.12159646 -1.81418562
O  3.72826983 -3.13528608 -0.42867486
O  2.9767249 1.42807901 2.7587103
O  -0.10063055 0.92514575 -0.23575596
O  2.19272558 2.1708755 0.05032301
O  1.11781807 -2.15696661 -0.31133243
O  -2.98735461 -2.3118293 -0.27349947
O  1.0108481 4.48723951 -0.827435
O  -1.23212263 2.86890525 -1.16740453
O  -2.61000736 0.49111473 -0.7922127
O  2.69283668 -2.898105 2.07722173
O  -1.1763781 -1.78419915 1.22748141
O  -0.83937754 -4.06815349 -0.94331761
H  0.45151874 0.48404559 0.43197832
H  2.50399521 -4.48270202 -1.45225251
H  -3.42031835 0.62369281 -1.29594627
Mo -1.96759806 2.20846273 0.53921923
O  -2.3659945 0.72464353 1.76385474
O  -4.71550663 -0.51995625 0.63720141
O  -0.81239974 3.02593445 1.50714822
O  -3.43002133 3.07295905 0.58428529
O  -3.54791276 -1.67583257 2.75516389
O  3.63760385 -0.45311981 0.57771919
O  1.15916164 2.44806467 -2.64501209
O  4.93125202 2.11450338 0.93608373
H  0.24043498 -0.93178351 1.89518529
H  1.0107249 -4.78505204 -1.53888786
H  -3.55141432 -2.07295873 -1.01520307
H  -1.44145517 -1.17566718 -3.10134804
H  1.28066114 -0.01992334 2.68308409
