program: Gaussian 16
title: Checking optimization
version: ES64L-G16RevA.03
frameworkgroup: C1[X(H4Mo6O22Pt)]
method: UM06L
basis: def2TZVP
operation: Freq
keyword: #P
keyword: Geom=AllCheck
keyword: Guess=TCheck
keyword: SCRF=Check
keyword: GenChk
keyword: UM06L/def2TZVPFreq
converged: YES YES YES YES
polarizability: 4.25978382e+02 -6.08445049e-01 4.16330101e+02 -1.41538653e+00 -2.28649484e-01 2.62360267e+02
1716.lowfreq: -5.3342 -0.0004 -0.0002 0.0001 2.8789 6.2858 17.0934 33.0813 39.0709
frequency: 16.9415 33.0269 39.0255 43.7405 58.1436 69.9970 74.3738 80.9145 90.3978 91.3497 93.1029 103.6386 110.0851 120.9479 125.9523 136.0598 142.0613 151.1221 152.7901 153.5224 166.2071 170.3672 179.7681 191.4326 195.6618 196.6213 203.9355 207.3899 210.1141 214.9929 222.1089 223.4063 241.1312 248.7976 255.4940 274.3700 282.2927 293.2092 301.5609 310.3538 312.7111 323.6155 328.2583 330.4939 333.7392 347.7750 356.7800 358.4322 359.5530 363.6747 368.7799 369.5414 380.4080 385.7483 389.7180 407.6106 434.6827 457.8046 471.1758 487.7450 489.6380 520.0330 528.3028 540.9311 553.8372 581.3413 595.9081 614.1400 710.1334 715.8515 722.5946 724.4878 766.1328 797.4615 801.2499 818.4256 847.1187 939.3619 944.2634 948.1723 954.1490 958.4394 962.5715 975.5850 978.6892 978.8537 983.4397 985.8810 996.2108 3820.4651 3821.1563 3834.6750 3837.2298
redmass: 22.8292 23.6777 30.0000 20.3271 26.8861 21.4727 31.3719 29.4578 25.1786 27.3841 26.4130 19.3638 17.7539 26.4425 23.4243 16.6931 16.6285 18.0969 17.3022 17.9556 19.2219 15.2138 15.9987 20.8232 20.0175 17.5316 16.0477 15.4683 16.2341 8.4795 14.3743 14.3357 5.0629 4.9685 20.7334 6.2310 8.8960 14.0436 13.8372 10.9837 11.6441 13.2702 11.5888 13.1021 8.4146 9.5396 16.1544 15.0285 13.7439 14.3468 13.5513 10.6107 10.9602 13.1580 9.6622 18.6475 20.5318 8.6745 13.5593 9.9135 7.6410 2.8333 1.5379 1.5920 4.1076 2.1322 1.4594 3.1312 3.6453 1.5584 1.6200 2.5634 12.2313 15.6106 16.4775 1.1746 1.1957 17.9032 18.4383 18.1641 17.2763 17.8583 18.7541 16.7626 16.1228 16.7903 15.8438 17.0878 16.5295 1.0663 1.0663 1.0663 1.0664
irintensity: 0.2413 0.0170 2.6388 0.0995 0.6329 0.0045 0.5150 0.0026 1.1165 0.2488 0.4122 0.1236 0.1599 0.3428 0.4629 1.1374 0.1264 2.3730 1.0326 0.4678 0.9978 0.0293 0.5413 6.0100 1.2192 0.5497 1.4442 1.6612 0.0099 1.0922 0.6547 0.9336 11.3073 0.5893 45.2766 38.7246 3.7252 20.4681 51.7942 8.7483 5.3599 8.7501 19.2453 10.0277 28.1840 38.9476 8.5525 5.5502 1.7940 6.6069 2.5391 24.7642 21.6953 4.1593 14.5068 4.3160 15.7432 9.9615 53.1614 59.8354 17.3601 18.9114 36.3310 10.6096 25.1235 121.8440 87.8546 46.5918 751.9326 448.1728 518.7186 1481.3020 53.0673 68.2639 190.3012 5.9835 81.1792 127.1660 91.5197 80.1324 7.5842 91.5304 747.2385 18.4633 9.1977 46.6541 444.2442 642.4463 1.1113 50.3817 35.6929 65.1510 28.9891
temp: 298.150 k
press: 1.00000 atm
elementType: 78 42 42 42 8 8 8 8 8 8 8 8 8 8 8 42 42 42 8 8 8 8 8 8 8 8 8 8 8 1 1 1 1
symmnumber: 1
zpe: 312771.9 jmol-1
zpe.correction: 0.119129 hartree
zpe.thermalcorrener: 0.156816 hartree
zpe.thermalcorrenthalpy: 0.157760 hartree
zpe.thermalcorrgfe: 0.047627 hartree
zpe.sumelectzpe: -2187.981437 hartree
zpe.sumelectthermal: -2187.943749 hartree
zpe.sumelectthermalent: -2187.942805 hartree
zpe.sumelectthermalfe: -2188.052939 hartree
dipole: 0.0325 -2.6722 -0.0438
dipole: 2.6728
quadrupole: -419.4810 -397.1699 -299.5382
quadrupole: -0.1742 -1.4225 0.0027
quadrupole: -47.4179 -25.1069 72.5248 -0.1742 -1.4225 0.0027
hfenergy: -2188.1005654 hartree
pointgroup: C01 [X(H4Mo6O22Pt1)]
dipole: -0.0750075 1.0487074 -0.0180304 debye
polarizability: 426.0122936|-0.0332372|416.2923406|1.6260163|0.2119422|262.3641163 unknown
InChI: InChI=1/6Mo.4H2O.18O.Pt/h;;;;;;4*1H2;;;;;;;;;;;;;;;;;;;/q;;;;;;;;;;;;;;;;;;;;;;;;;;;;+4/p-4/rH4Mo6O22Pt/c7-1(8)23-2(9,10)25-4(13,14)27-6(17,18,29(19,20,21)22)28-5(15,16)26-3(11,12)24-1/h19-22H
charge -2 multiplicity 3
33 atoms
Pt -0.02402337 0.33514677 -0.01020268
Mo -3.46544245 1.40538834 -0.40479757
Mo -2.80896683 -1.92113752 0.37499402
Mo 0.30082343 -3.24943717 0.01335388
O  -0.36883549 -4.34883746 -1.09554361
O  1.23045162 -1.23509739 0.97905315
O  -1.82875726 0.16986252 1.03234581
O  1.15161833 -4.18910369 1.14483887
O  -4.15535106 1.84231365 1.08967299
O  -1.23552963 -2.71773432 1.09710034
O  -3.46036157 -3.15647956 -0.59022374
O  -3.57335797 -0.39525767 -0.75007089
O  -3.80244553 -1.80850082 1.75321659
O  1.71502134 -2.4784416 -1.0897506
O  -4.44155834 2.12448039 -1.60442206
Mo 3.12607414 -1.41491531 -0.37865779
Mo 3.16122167 1.9646294 0.40056972
Mo -0.28388098 3.21623109 0.00618594
O  -0.96568462 4.14762145 1.25395784
O  1.78834255 0.4750337 -1.04458114
O  -0.97437122 -1.4400766 -0.98860887
O  0.23755499 4.26270654 -1.22749204
O  4.07765601 -1.12809688 -1.76116868
O  1.31031391 2.48584653 0.76244822
O  3.98349703 2.84610116 1.6070621
O  3.6078631 0.21661058 0.74392864
O  3.76564092 2.52994586 -1.08796177
O  -1.73796549 2.24796135 -0.76162441
O  3.98971256 -2.51689197 0.58163387
H  -1.04669635 -1.32907797 -1.94208933
H  1.74371481 0.65625341 -1.98760598
H  -1.80029314 0.34346385 1.97758345
H  1.2830149 -1.10641068 1.93168576
