program: Gaussian 16
title: Checking optimization
version: ES64L-G16RevA.03
frameworkgroup: C1[X(CH4Mo6O20Pt)]
method: RM06L
basis: def2TZVP
operation: Freq
keyword: #P
keyword: Geom=AllCheck
keyword: Guess=TCheck
keyword: SCRF=Check
keyword: GenChk
keyword: RM06L/def2TZVPFreq
converged: YES YES NO YES
title: Mulliken charges:
elementType: Pt Mo Mo Mo Mo Mo O O O O O O O O O O O O H H Mo O O O O O O O O H C H
charge: 0.553365 1.879509 1.814394 1.424715 1.871940 1.514504 -0.786890 -0.648917 -0.626329 -0.781610 -0.828039 -0.816471 -0.612070 -0.794851 -0.750691 -0.628987 -0.652931 -0.597306 0.411278 0.365089 1.870820 -0.719318 -0.619529 -0.603208 -0.622893 -0.569239 -0.791653 -0.649669 -0.599495 0.373083 -0.543125 0.164525
chargesum: -2.00000
title: Mulliken charges with hydrogens summed into heavy atoms:
elementType: Pt Mo Mo Mo Mo Mo O O O O O O O O O O O O Mo O O O O O O O O C
charge: 0.553365 1.879509 1.814394 1.424715 1.871940 1.514504 -0.413807 -0.648917 -0.626329 -0.370332 -0.828039 -0.816471 -0.612070 -0.794851 -0.385602 -0.628987 -0.652931 -0.597306 1.870820 -0.719318 -0.619529 -0.603208 -0.622893 -0.569239 -0.791653 -0.649669 -0.599495 -0.378601
polarizability: 4.72501368e+02 -6.71146232e+00 3.58525312e+02 4.10300411e+00 2.19988487e+00 2.74552210e+02
1716.lowfreq: 0.0001 0.0003 0.0004 2.5712 4.5721 6.7967 15.1676 23.9288 35.5319
frequency: 14.9623 23.8867 35.5232 37.8338 46.0362 49.9450 58.7815 62.1616 73.4258 83.6801 83.7372 92.8308 98.6900 107.5520 108.9539 113.4869 133.8878 149.5303 158.7307 165.1908 171.4055 175.7955 184.8284 188.4504 191.6241 193.5118 198.9664 206.7067 216.4996 222.6291 229.9122 236.6041 245.2614 254.0473 264.9362 276.4044 286.3267 296.1463 313.0967 315.6783 319.6243 322.0651 328.6129 334.7424 347.0336 351.7592 354.8358 361.9482 366.6834 368.0251 370.8561 378.9976 387.1464 470.1458 477.1047 499.9556 530.5110 533.9592 565.6592 583.5363 593.6251 605.5359 635.7312 681.7316 734.4697 741.2414 752.1248 764.8777 774.8772 775.7463 804.2741 818.4156 831.8638 842.5063 901.3496 942.7539 946.9332 950.8109 951.3810 959.4949 968.7035 978.0259 982.7670 984.1413 988.8761 995.1674 3050.6652 3695.2720 3731.3096 3847.3485
redmass: 22.9706 24.3291 25.1562 27.4952 30.3775 28.0562 27.6934 29.5774 17.7231 19.1809 19.8903 20.6687 20.4556 17.1855 23.7401 20.0788 22.3402 22.4982 16.9020 17.1593 16.3384 17.0215 20.0457 20.1987 19.4516 15.9352 18.2497 17.1063 16.9944 13.5851 14.2155 13.6788 9.1906 8.3531 14.3368 8.1290 10.5051 9.8274 11.1348 15.8206 14.2720 13.9630 9.8802 11.9538 7.1952 11.7103 11.9472 13.8579 12.2650 11.7796 11.7150 12.2865 11.8367 7.5923 9.6953 14.4610 12.9719 13.1153 1.2352 5.8583 4.5160 1.2281 9.8225 6.6471 1.5354 1.5672 4.6301 1.3863 1.7041 2.2369 1.3885 1.5237 3.3378 7.0820 5.3142 17.2822 16.9502 16.8254 15.6829 18.0467 15.7084 16.4198 15.9526 16.6420 17.3112 16.7344 1.0868 1.0659 1.0662 1.0661
irintensity: 0.2566 0.8342 0.0624 1.5463 0.1517 0.1877 0.5529 0.3750 0.2594 0.7429 0.0677 0.6257 1.2055 3.6009 1.6089 0.7013 1.8656 1.8991 0.0763 0.4479 1.2002 6.0364 1.9200 2.6955 1.0508 0.8097 2.4634 1.6861 30.1226 5.3368 5.9508 13.9318 10.5894 20.1558 0.6026 1.8715 14.7992 43.7377 20.4868 69.3979 5.0954 11.6567 11.0854 37.5760 16.4055 13.9655 7.0748 17.9967 17.0096 14.1071 13.7544 6.4891 46.4098 5.4690 32.0329 38.3848 142.5162 45.9940 53.7395 37.8577 16.0729 51.5258 142.0285 395.6361 78.3566 363.1870 1615.6687 81.6825 18.0364 151.3183 165.0858 243.3454 90.5054 271.0546 42.3407 83.7021 0.6748 376.0191 66.7318 464.6844 135.8802 127.6068 310.1813 221.9571 167.8729 85.9485 1.1104 50.4510 36.6986 73.8808
temp: 298.150 k
press: 1.00000 atm
elementType: 78 42 42 42 42 42 8 8 8 8 8 8 8 8 8 8 8 8 1 1 42 8 8 8 8 8 8 8 8 1 6 1
symmnumber: 1
zpe: 304167.8 jmol-1
zpe.correction: 0.115851 hartree
zpe.thermalcorrener: 0.152353 hartree
zpe.thermalcorrenthalpy: 0.153297 hartree
zpe.thermalcorrgfe: 0.044127 hartree
zpe.sumelectzpe: -2075.528633 hartree
zpe.sumelectthermal: -2075.492131 hartree
zpe.sumelectthermalent: -2075.491187 hartree
zpe.sumelectthermalfe: -2075.600357 hartree
dipole: -2.0067 -1.8030 -3.7921
dipole: 4.6538
quadrupole: -419.2662 -361.5311 -303.7184
quadrupole: 0.4310 3.1727 1.4224
quadrupole: -57.7610 -0.0259 57.7869 0.4310 3.1727 1.4224
hfenergy: -2075.6444844 hartree
pointgroup: C01 [X(C1H4Mo6O20Pt1)]
dipole: 0.8558777 -0.6970338 1.4608085 debye
polarizability: 471.590951|12.5231217|359.5815115|0.3866256|-0.5301059|274.4064285 unknown
InChI: InChI=1/CH.6Mo.2H2O.HO.17O.Pt/h1H;;;;;;;2*1H2;1H;;;;;;;;;;;;;;;;;;/q;;;;;2*+1;;;;;;;;;;;;;;;;;;;;;/p-2/rCH4Mo6O20Pt/c8-2(9)22-3(10,11)26-7(19,20,21)27-28(7)1-5(28,14,15)23-4(12,13)25-6(16,17,18)24-2/h1,16,19,27H
charge -2 multiplicity 1
32 atoms
Pt 0.45471109 -0.70298923 1.07546392
Mo -4.37627878 -0.54219503 -0.36276368
Mo -2.37161589 1.86256559 0.93360237
Mo 2.64335968 -1.94255054 -0.07928172
Mo 0.96740815 2.85724512 -0.52881916
Mo -1.38068151 -2.10675884 -0.49646011
O  -2.22919123 0.44872156 -0.61372065
O  -5.73227637 -1.31872803 0.31885727
O  -3.04684088 3.3778382 0.57803222
O  1.75010333 0.06229516 -0.74795313
O  -0.50142818 2.15607394 0.35435586
O  -3.26968279 -2.04632321 -0.7949796
O  0.87370421 2.48795596 -2.19151986
O  2.62056384 2.37075882 0.21452936
O  2.57501266 -0.27582028 1.45394863
O  -4.94698995 0.20547936 -1.78063027
O  -0.569989 -1.35812201 -1.83982301
O  -0.93282834 -3.73961248 -0.3859529
H  1.27506144 -0.11307695 -1.57675066
H  2.94198259 -0.59118597 2.28443474
Mo 3.86610078 0.94872046 -0.25864597
O  4.15848152 -0.98517061 -0.60386315
O  3.11432748 -3.07116507 1.11179384
O  4.45504083 1.55053163 -1.72907524
O  5.08857787 1.22636923 0.88931378
O  2.08430548 -2.83534516 -1.40809668
O  -3.97519339 0.72682484 0.98708709
O  0.88376331 4.55286892 -0.39330349
O  -2.03399735 1.79174237 2.60531567
H  -1.53388574 0.51612962 -1.2830137
C  -1.27422109 -1.27121269 1.40875271
H  -1.8894038 -0.70886467 2.12416553
