program: Gaussian 16
title: Checking optimization
version: ES64L-G16RevA.03
frameworkgroup: C1[X(CH5Mo6O20Pt)]
method: UM06L
basis: def2TZVP
operation: Freq
keyword: #P
keyword: Geom=AllCheck
keyword: Guess=TCheck
keyword: SCRF=Check
keyword: GenChk
keyword: UM06L/def2TZVP
keyword: Freq
converged: YES YES NO YES
polarizability: 4.80172230e+02 8.37125805e+00 3.53841323e+02 6.08213459e+00 -5.61598198e+00 2.84930211e+02
1716.lowfreq: -6.7440 0.0002 0.0002 0.0004 1.7842 4.2126 16.4200 28.0955 35.9932
frequency: 16.1133 28.0540 35.9614 38.3013 43.7094 52.1869 56.8193 64.6319 71.9326 77.3849 85.6204 96.9904 100.3449 105.3174 110.5480 117.6036 137.3410 153.2412 157.6877 163.7375 172.4521 174.2610 183.4797 190.3939 192.5675 193.5818 200.2869 202.4549 206.3272 215.7839 220.9685 232.8675 239.6410 245.0841 250.5345 255.5971 278.5076 287.4606 304.2959 307.9881 320.0278 324.7165 326.1892 338.4374 347.2740 349.5535 350.7157 357.0696 359.7046 366.8943 367.2630 368.5973 378.5930 393.7933 429.8906 437.4538 448.9235 474.9850 517.1027 525.0278 531.5459 541.4192 570.0733 646.4475 654.3327 657.3866 693.8677 715.2869 764.7394 775.9857 778.1309 797.8582 813.8108 844.0603 910.5945 941.9175 943.1823 945.2724 951.7423 955.1603 961.1564 966.4268 976.9187 979.0128 981.7832 986.4478 993.1672 1386.2171 3051.5949 3161.7639 3663.0568 3825.4747 3848.9146
redmass: 25.0394 23.5227 25.8015 25.0507 24.0445 31.7233 28.0253 17.8431 18.1393 19.4566 19.5240 17.7236 17.3979 17.6636 17.5851 17.1342 16.0440 21.9901 17.5383 21.2341 17.0661 20.2718 17.2129 15.5875 18.6343 18.5311 14.6390 14.9963 10.1959 11.0232 11.2938 10.2643 9.3451 6.4214 11.9790 12.0718 9.8531 10.6141 7.1478 12.4465 7.8033 11.1518 12.5332 11.6417 11.2357 10.5674 8.3162 12.3601 14.8533 8.6968 12.8046 8.4427 12.8671 13.8244 2.4811 1.6495 11.9583 3.3682 16.2363 1.5283 4.7511 3.1158 2.2351 1.6920 2.1581 8.3101 8.7316 1.2583 1.3203 2.1757 2.4074 1.6966 3.2794 13.7881 2.4556 17.3680 16.6876 7.7819 12.7172 15.2981 2.5219 14.7191 14.9462 15.9570 12.1410 16.2955 16.9622 1.1261 1.0530 1.1090 1.0663 1.0661 1.0662
irintensity: 0.6877 0.1603 0.0814 0.7679 0.6347 0.4083 0.1968 0.1683 0.3804 0.9080 0.7353 0.4239 0.8555 0.5960 0.3917 0.6522 1.0843 1.6830 1.5580 0.3577 4.3361 0.6024 2.3696 0.3447 4.1493 1.3859 5.6119 3.4149 3.9377 10.1336 22.9670 1.3070 4.8233 6.0440 10.5932 11.0702 15.3045 17.9290 33.5770 14.5736 26.6665 13.6570 26.5311 28.7142 19.0431 61.9469 18.6056 16.5969 15.8016 8.6339 27.3974 4.7955 54.3037 13.6243 11.6285 10.2937 49.6880 25.3670 51.7010 6.4611 15.9116 44.0077 216.5001 26.2561 28.2804 16.4654 543.8512 47.1943 69.0778 940.6834 954.3411 52.8957 409.0658 232.4166 165.6319 18.6420 203.8997 120.5478 130.5197 556.7270 98.9120 88.1893 96.7917 338.2729 320.9393 174.0372 23.2000 7.3009 10.3333 5.2784 79.7078 47.3198 56.5287
temp: 298.150 k
press: 1.00000 atm
elementType: 78 42 42 42 42 42 8 8 8 8 8 8 8 8 8 8 8 8 1 1 42 8 8 8 8 8 8 8 8 1 6 1 1
symmnumber: 1
zpe: 330558.2 jmol-1
zpe.correction: 0.125903 hartree
zpe.thermalcorrener: 0.163214 hartree
zpe.thermalcorrenthalpy: 0.164158 hartree
zpe.thermalcorrgfe: 0.053200 hartree
zpe.sumelectzpe: -2076.157511 hartree
zpe.sumelectthermal: -2076.120200 hartree
zpe.sumelectthermalent: -2076.119255 hartree
zpe.sumelectthermalfe: -2076.230214 hartree
dipole: 0.7913 -1.3978 2.4784
dipole: 2.9534
quadrupole: -423.3237 -356.1857 -308.3425
quadrupole: 3.0672 0.4250 0.1251
quadrupole: -60.7064 6.4315 54.2748 3.0672 0.4250 0.1251
hfenergy: -2076.2834138 hartree
pointgroup: C01[X(C1H5Mo6O20Pt1)]
dipole: 0.2953001 -0.5661803 0.9707433 debye
polarizability: 480.4336253|5.5132246|353.6366334|6.7535075|-5.0613646|284.8735061 unknown
InChI: InChI=1/CH2.6Mo.H2O.2HO.17O.Pt/h1H2;;;;;;;1H2;2*1H;;;;;;;;;;;;;;;;;;/q;;;;;;+1;;;;;;;;;;;;;;;;;;;;;/p-1/rCH4Mo6O19Pt.HO/c8-2(9)21-3(10,11)25-7(19,20)26-27(7)1-5(27,14,15)22-4(12,13)24-6(16,17,18)23-2;/h16,26H,1H2;1H
charge -2 multiplicity 2
33 atoms
Pt 0.42232442 -0.82762561 0.48183006
Mo -4.41514027 -0.21726155 -0.36453094
Mo -2.19607112 1.86736339 1.13530841
Mo 2.81232078 -2.00546335 0.376903
Mo 0.8395013 2.65717727 -0.79894767
Mo -1.52304863 -1.9997156 -0.85445523
O  -2.003498 0.51501059 -0.49122796
O  -5.9582999 -0.78844391 0.0833565
O  -2.88590994 3.40947008 0.97198816
O  2.04899031 -0.32496646 -0.96196054
O  -0.36292202 2.31124367 0.56746581
O  -3.4266801 -1.80799741 -0.66357133
O  0.3073478 1.77775889 -2.17004945
O  2.58450478 2.29196145 -0.31742843
O  2.39607865 0.05470222 1.34269527
O  -4.64108362 0.69976535 -1.78276362
O  -0.99926983 -1.400749 -2.36753788
O  -1.21655844 -3.66702996 -0.82075023
H  1.81195413 -0.51184678 -1.87624111
H  2.55169107 0.02901554 2.29066446
Mo 3.93851088 0.86249933 -0.21527364
O  4.39091631 -1.04537374 0.02454605
O  2.98261922 -2.78128795 1.88881337
O  4.66232881 1.09992094 -1.73462692
O  4.98501153 1.56000379 0.92822013
O  2.65934092 -3.22688227 -0.79876146
O  -3.86926618 0.80910052 1.09854011
O  0.76357202 4.31696458 -1.18512163
O  -1.84333654 1.5869479 2.77519604
H  -1.47999795 0.83020852 -1.24794987
C  -1.05617755 -1.60017101 1.47016483
H  -1.83846634 -0.96207457 1.89114699
H  -1.02428651 -2.59022487 1.92235871
