program: Orca
programVersion: 6.0.1
elementType: C H H H C C H H H O H H
charge: 0
multiplicity: 1
keywords: wB97X-D3BJ TightOpt Freq def2-TZVPP def2/J RIJCOSX TightSCF defgrid3
frequency: 0.00 0.00 0.00 0.00 0.00 0.00 224.29 257.34 265.91 363.62 430.63 474.50 836.08 932.73 946.86 988.14 1097.60 1166.58 1203.75 1312.36 1373.97 1416.52 1419.03 1431.26 1490.31 1491.92 1505.10 1513.22 3047.45 3051.66 3081.60 3116.73 3128.22 3144.79 3147.60 3868.84
frequency: 224.29 257.34 265.91 363.62 430.63 474.50 836.08 932.73 946.86 988.14 1097.60 1166.58 1203.75 1312.36 1373.97 1416.52 1419.03 1431.26 1490.31 1491.92 1505.10 1513.22 3047.45 3051.66 3081.60 3116.73 3128.22 3144.79 3147.60 3868.84
formula: C3H8O
InChI: InChI=1/C3H8O/c1-3(2)4/h3-4H,1-2H3
12 atoms
C  -2.840074 -0.641926 -0.006631
H  -2.466596 -1.667906 -0.045672
H  -2.493727 -0.109174 -0.893363
H  -3.934019 -0.682207 -0.032809
C  -2.365345 0.06351 1.257363
C  -2.84198 -0.640635 2.521378
H  -2.497444 -0.106468 3.407968
H  -3.935934 -0.681586 2.545761
H  -2.46785 -1.666301 2.56243
O  -2.759703 1.435076 1.256342
H  -3.719415 1.468856 1.255124
H  -1.272623 0.099083 1.258245
totalener: -194.50712183779376 hartree
nucrepener: 135.28313224150685 hartree
electener: -329.79025529156542 hartree
oneelecener: -530.49435763937277 hartree
twoeener: 200.70410234780735 hartree
kineticenergy: 193.75615914339028 hartree
exchangeener: -17.764095327663 hartree
correlationener: -1.374974566388 hartree
xcener: -19.139069894051 hartree
dispersion: -0.012858721 hartree
dispersion: -0.012760648 hartree
dispersion: -0.012739263 hartree
dispersion: -0.012730844 hartree
dispersion: -0.012727710 hartree
dispersion: -0.012727345 hartree
energy: -522.6311 -280.8577 -279.2235 -279.2232 -31.3090 -24.6772 -22.4120 -19.7894 -16.2303 -15.9693 -14.7810 -14.2959 -13.6304 -12.7500 -12.6199 -11.6084 -10.3657 2.8243 3.8920 4.3622 4.4906 4.8725 5.1502 5.8688 6.2557 6.3036 6.6689 7.3844 electronvolt
chargesum: 0.0000000
charge: -0.262821 0.072311 0.099196 0.062856 0.176872 -0.262832 0.099197 0.062871 0.072313 -0.355611 0.183932 0.051716
charge: -0.001039 0.012546 0.012556 0.007729 -0.203269 -0.001037 0.012563 0.007724 0.012540 0.265737 -0.143788 0.017740
qa: -0.2628 0.0723 0.0992 0.0629 0.1769 -0.2628 0.0992 0.0629 0.0723 -0.3556 0.1839 0.0517
va: 3.9386 1.0091 1.0079 1.0096 3.9656 3.9385 1.0079 1.0096 1.0091 2.0413 1.0482 0.9864
dispersion: -0.012727490 hartree
energy: -194.524296287960 hartree
dipole: -0.924795953 0.574953264 -0.349842689 -3.736474182 3.195269765 -0.541204417 0.001006220 -0.001276393 -0.000270172
dipolemethod: SCF
magnitude: 0.644431688 au
magnitude: 1.638015176 debye
temp: 298.15 k
press: 1.00 atm
zeropoint: 0.10873377 hartree
thermalvibcorrection: 0.00265530 hartree
thermalrotcorrection: 0.00141627 hartree
thermaltrasncorrection: 0.00141627 hartree
thermaltotal: -194.41007467 hartree
thermalcorr: 0.00548785 hartree
nonthermalcorr: 0.10873377 hartree
totalcorr: 0.11422162 hartree
thermalcorrenthalpy: 0.00094421 hartree
totalenthalpy: -194.40913046 hartree
vibrat: 0.00415540 hartree
rotat: 0.01159235 hartree
transl: 0.01815004 hartree
total: 0.03389779 hartree
totalentropycorr: -0.03389779 hartree
gibbsenthalpy: -194.44302825 hartree
gibbsminuselec: 0.08126804 hartree
