program: Orca
programVersion: 6.0.1
elementType: C C C C C C H H H H O C H H H C C C C H H C H C H H H H H H O H C H H N C H H H C H H H H O H C C H H H C H H H H
charge: 1
multiplicity: 1
keywords: DLPNO-CCSD(T) def2-TZVPP def2-TZVPP/C VeryTightSCF
formula: C19H34NO3
InChI: InChI=1/C16H26NO2.C3H8O/c1-17(2)12-14-7-4-5-10-16(14,18)13-8-6-9-15(11-13)19-3;1-3(2)4/h6,8-9,11,14,17-18H,4-5,7,10,12H2,1-3H3;3-4H,1-2H3
57 atoms
C  2.356984 -1.803043 -1.776833
C  2.250744 -1.397306 -0.452686
C  1.12807 -0.678389 -0.029186
C  0.113205 -0.355146 -0.912865
C  0.222499 -0.76241 -2.246299
C  1.332097 -1.476234 -2.661294
H  3.214381 -2.357633 -2.130411
H  1.09782 -0.36366 1.005169
H  -0.550324 -0.519058 -2.965006
H  1.412338 -1.786562 -3.696447
O  3.17306 -1.646609 0.508804
C  4.361798 -2.326986 0.126728
H  4.138403 -3.330043 -0.246579
H  4.907084 -1.76407 -0.635367
H  4.967668 -2.401559 1.026511
C  -1.116751 0.420801 -0.446543
C  -1.239259 1.746408 -1.210374
C  -2.398395 -0.424502 -0.64168
C  -2.505305 2.518761 -0.849146
H  -1.23103 1.530152 -2.281308
H  -0.347111 2.3428 -1.004818
C  -3.64781 0.367423 -0.243714
H  -2.473673 -0.634142 -1.712862
C  -3.749204 1.657705 -1.055352
H  -2.56368 3.422946 -1.458279
H  -2.453403 2.840751 0.19436
H  -4.53588 -0.253188 -0.395773
H  -3.605132 0.634411 0.814815
H  -4.646395 2.20845 -0.766477
H  -3.856595 1.411757 -2.117753
O  -1.05043 0.682306 0.96249
H  -0.323524 1.310088 1.153879
C  -2.279233 -1.809065 -0.000842
H  -1.484435 -2.36562 -0.493764
H  -3.208661 -2.37201 -0.095865
N  -1.922609 -1.765191 1.467227
C  -0.971851 -2.848373 1.832858
H  -0.734942 -2.768636 2.89236
H  -1.44049 -3.81057 1.629928
H  -0.067689 -2.735426 1.239305
C  -3.117659 -1.798212 2.350554
H  -3.805236 -1.010906 2.059543
H  -3.600056 -2.769428 2.248221
H  -2.798906 -1.650618 3.380766
H  -1.448227 -0.844016 1.585633
O  1.037052 2.345307 1.477095
H  1.106126 2.907915 2.252255
C  2.169638 2.599385 0.614287
C  3.445563 2.078836 1.253964
H  4.291661 2.221151 0.578749
H  3.66134 2.620987 2.179202
H  3.360497 1.01532 1.48083
C  2.238006 4.075863 0.263703
H  2.434332 4.675693 1.157639
H  3.046682 4.262344 -0.444942
H  1.301498 4.414924 -0.182093
H  1.953034 2.016955 -0.283522
totalener: -1018.52117813935183 hartree
nucrepener: 2232.14915883687627 hartree
electener: -3250.67033697622810 hartree
oneelecener: -5806.15091050917090 hartree
twoeener: 2555.48057353294280 hartree
kineticenergy: 1017.64020038500109 hartree
energy: -562.7257 -562.4142 -562.3681 -429.9346 -310.4495 -310.4320 -310.4127 -310.3874 -310.2211 -309.5555 -309.3868 -309.0590 -308.8025 -308.5457 -308.3115 -308.1949 -308.1807 -308.1755 -308.0866 -307.9079 -307.7958 -307.5825 -307.4932 -41.0381 -40.5763 -39.9532 -39.2985 -34.3640 -33.5442 -31.6454 -31.2295 -30.9761 -30.6617 -30.5790 -29.7820 -29.1754 -28.2077 -27.9928 -27.9056 -26.1739 -25.8201 -25.2478 -24.8753 -24.3414 -23.9380 -23.5437 -22.5169 -21.9247 -21.8270 -21.4184 -21.0014 -20.8413 -20.5963 -20.5053 -20.3946 -20.1822 -20.0362 -19.7055 -19.6047 -19.2985 -19.1223 -19.0430 -18.9587 -18.8490 -18.6244 -18.4944 -18.3785 -17.9715 -17.9066 -17.4862 -17.3035 -17.2308 -17.1846 -16.9744 -16.8019 -16.7487 -16.4766 -16.4129 -16.2021 -15.8858 -15.7992 -15.5440 -15.3776 -15.2791 -14.8650 -14.6448 -14.5120 -12.0268 -11.2875 0.2276 0.5848 0.8074 0.9906 1.0649 1.2858 1.4550 1.6086 1.8300 1.9544 2.0165 electronvolt
chargesum: 1.0000000
charge: -0.188394 0.355570 -0.415910 0.027860 -0.303155 -0.091446 0.112045 0.108929 0.099403 0.120599 -0.386903 -0.029472 0.079986 0.081318 0.101699 0.740524 -0.180078 0.042393 -0.105602 0.078131 0.049582 -0.215630 0.089225 -0.122420 0.082986 0.058588 0.089661 0.060294 0.087804 0.058540 -0.582519 0.263038 -0.220734 0.150868 0.137726 0.090319 -0.139251 0.113015 0.112327 0.120430 -0.131260 0.117463 0.106768 0.113282 0.198281 -0.481487 0.222757 0.286105 -0.208263 0.069548 0.065077 0.069900 -0.192353 0.063183 0.071261 0.075249 0.023145
charge: -0.022892 -0.185884 -0.016230 -0.062480 -0.026382 0.012023 0.017949 0.016169 0.015856 0.028027 0.227405 -0.016276 0.003511 0.005058 0.011596 -0.183745 0.006181 -0.052266 -0.004874 0.026040 0.023805 -0.007580 0.043745 -0.004362 0.018965 0.016995 0.017691 0.013217 0.018997 0.018176 0.297005 -0.171466 0.046358 0.032143 0.029306 0.432076 0.075028 0.021150 0.022739 0.021042 0.076537 0.018864 0.022574 0.021452 -0.030512 0.278957 -0.127430 -0.156883 0.021554 0.017227 0.010137 0.009905 0.021277 0.011055 0.018333 0.009309 0.013829
qa: -0.1884 0.3556 -0.4159 0.0279 -0.3032 -0.0914 0.1120 0.1089 0.0994 0.1206 -0.3869 -0.0295 0.0800 0.0813 0.1017 0.7405 -0.1801 0.0424 -0.1056 0.0781 0.0496 -0.2156 0.0892 -0.1224 0.0830 0.0586 0.0897 0.0603 0.0878 0.0585 -0.5825 0.2630 -0.2207 0.1509 0.1377 0.0903 -0.1393 0.1130 0.1123 0.1204 -0.1313 0.1175 0.1068 0.1133 0.1983 -0.4815 0.2228 0.2861 -0.2083 0.0695 0.0651 0.0699 -0.1924 0.0632 0.0713 0.0752 0.0231
va: 3.9785 3.9239 3.8494 3.2310 4.1309 4.0225 1.0117 1.0552 1.0167 1.0068 1.9120 3.8789 0.9914 0.9920 0.9997 3.3185 3.9619 3.7925 3.9042 1.0172 1.0288 3.9573 1.0167 3.8982 1.0143 1.0256 1.0084 1.0191 1.0120 1.0220 1.8462 1.0604 3.9565 0.9852 1.0000 3.5086 3.8841 0.9997 1.0018 0.9939 3.8826 0.9992 1.0027 1.0003 1.0564 1.8623 1.0174 3.7359 3.9895 1.0121 1.0134 1.0075 3.9750 1.0109 1.0120 1.0042 0.9937
e0: -1018.521178140 hartree
corrType: DLPNO BASED
energy: -1022.994673945111 hartree
dipole: -4.218622916 2.956371077 -1.262251839 5.640384878 -7.255825054 -1.615440176 5.586157004 -4.312699648 1.273457356
dipolemethod: SCF
magnitude: 2.413425016 au
magnitude: 6.134438879 debye
