program: Orca
programVersion: 6.0.1
elementType: C H C H H C C C C H C H C H H C C C C H H C H H C H H H H H H O H O H N C H H H C H H H H
charge: 1
multiplicity: 1
keywords: wB97X-D3BJ TightOpt Freq def2-TZVPP def2/J RIJCOSX TightSCF defgrid3 CHELPG
frequency: 0.00 0.00 0.00 0.00 0.00 0.00 33.98 46.69 52.11 66.42 90.13 104.36 153.38 180.91 194.33 213.40 224.03 238.03 241.37 258.69 291.34 317.34 330.25 360.34 376.55 379.48 407.62 417.88 429.61 432.38 437.15 456.87 492.24 506.44 539.39 569.07 577.15 625.50 665.12 720.52 759.81 798.53 831.33 851.03 855.86 865.86 871.69 876.45 907.43 923.61 936.01 947.48 979.40 988.43 1000.20 1010.77 1011.71 1041.42 1044.76 1062.06 1069.83 1080.10 1104.66 1111.52 1123.98 1145.12 1177.36 1181.90 1187.02 1196.77 1212.38 1213.48 1231.77 1267.34 1270.37 1275.53 1298.42 1305.17 1315.38 1329.86 1331.44 1335.71 1361.95 1372.40 1375.19 1384.80 1392.03 1405.76 1409.88 1429.57 1432.39 1459.98 1477.39 1486.11 1489.12 1491.59 1496.13 1499.84 1502.68 1507.54 1512.97 1513.21 1517.79 1524.05 1529.01 1536.49 1583.11 1677.45 1706.58 3030.58 3039.74 3062.81 3065.99 3074.68 3085.52 3093.75 3101.29 3114.98 3116.77 3118.32 3121.12 3128.40 3132.70 3176.43 3181.74 3189.13 3191.59 3195.79 3199.56 3204.70 3207.94 3212.61 3233.02 3880.02 3882.30
frequency: 33.98 46.69 52.11 66.42 90.13 104.36 153.38 180.91 194.33 213.40 224.03 238.03 241.37 258.69 291.34 317.34 330.25 360.34 376.55 379.48 407.62 417.88 429.61 432.38 437.15 456.87 492.24 506.44 539.39 569.07 577.15 625.50 665.12 720.52 759.81 798.53 831.33 851.03 855.86 865.86 871.69 876.45 907.43 923.61 936.01 947.48 979.40 988.43 1000.20 1010.77 1011.71 1041.42 1044.76 1062.06 1069.83 1080.10 1104.66 1111.52 1123.98 1145.12 1177.36 1181.90 1187.02 1196.77 1212.38 1213.48 1231.77 1267.34 1270.37 1275.53 1298.42 1305.17 1315.38 1329.86 1331.44 1335.71 1361.95 1372.40 1375.19 1384.80 1392.03 1405.76 1409.88 1429.57 1432.39 1459.98 1477.39 1486.11 1489.12 1491.59 1496.13 1499.84 1502.68 1507.54 1512.97 1513.21 1517.79 1524.05 1529.01 1536.49 1583.11 1677.45 1706.58 3030.58 3039.74 3062.81 3065.99 3074.68 3085.52 3093.75 3101.29 3114.98 3116.77 3118.32 3121.12 3128.40 3132.70 3176.43 3181.74 3189.13 3191.59 3195.79 3199.56 3204.70 3207.94 3212.61 3233.02 3880.02 3882.30
formula: C16H26NO2
InChI: InChI=1/C16H26NO2/c1-17(2)12-15(13-6-8-14(18)9-7-13)16(19)10-4-3-5-11-16/h6-9,15,17-19H,3-5,10-12H2,1-2H3
45 atoms
C  0.397208 -0.615899 -0.430256
H  0.542466 -0.859373 -1.4863
C  0.978639 -1.761779 0.404857
H  0.966406 -1.519917 1.465363
H  0.396132 -2.671711 0.258921
C  -1.101449 -0.556415 -0.202809
C  -1.668413 -0.591107 1.072333
C  -1.960709 -0.476272 -1.293944
C  -3.038514 -0.534885 1.254278
H  -1.042698 -0.659122 1.954864
C  -3.336213 -0.415563 -1.130595
H  -1.552502 -0.455869 -2.298888
C  -3.881421 -0.442831 0.149377
H  -3.473768 -0.561823 2.245153
H  -3.983935 -0.351282 -1.998455
C  1.120808 0.740433 -0.226053
C  0.564401 1.78624 -1.193387
C  1.072917 1.270315 1.208395
C  1.264755 3.139169 -1.057222
H  -0.499014 1.912842 -0.979591
H  0.648691 1.40605 -2.215144
C  1.775696 2.623092 1.350425
H  0.025508 1.387027 1.493128
H  1.520694 0.54639 1.895816
C  1.1973 3.651129 0.380153
H  0.802283 3.852256 -1.741825
H  2.31264 3.066479 -1.376676
H  1.678317 2.970848 2.380495
H  2.852885 2.512278 1.17478
H  1.728771 4.600127 0.472512
H  0.152114 3.845205 0.643415
O  2.502622 0.451911 -0.587091
H  3.003578 1.270413 -0.603725
O  -5.213797 -0.389182 0.386606
H  -5.700004 -0.329106 -0.43948
N  2.408263 -2.084991 0.057475
C  3.097886 -2.777972 1.175397
H  2.568513 -3.703688 1.397539
H  4.122223 -2.99879 0.88161
H  3.094552 -2.12978 2.049431
C  2.518725 -2.860735 -1.206194
H  2.03341 -2.311837 -2.008058
H  3.571687 -2.997734 -1.444027
H  2.038566 -3.828279 -1.067111
H  2.841182 -1.157441 -0.105928
totalener: -830.98350431774395 hartree
nucrepener: 1568.85653405029029 hartree
electener: -2399.84003960050950 hartree
oneelecener: -4223.75707452525148 hartree
twoeener: 1823.91703492474198 hartree
kineticenergy: 827.19033306342385 hartree
exchangeener: -77.117744767176 hartree
correlationener: -5.945177059828 hartree
xcener: -83.062921827005 hartree
dispersion: -0.096323738 hartree
temp: 298.15 k
press: 1.00 atm
thermalcorrenthalpy: 0.00094421 hartree
totalenthalpy: -830.65026094 hartree
vibrat: 0.02734941 hartree
rotat: 0.01608380 hartree
transl: 0.02024821 hartree
total: 0.06368142 hartree
totalentropycorr: -0.06368142 hartree
gibbsenthalpy: -830.71394236 hartree
gibbsminuselec: 0.36588569 hartree
dispersion: -0.096297632 hartree
energy: -526.8179 -526.1965 -399.1737 -284.8536 -284.8381 -284.7872 -284.6633 -284.0497 -283.6359 -282.7575 -282.6295 -282.6001 -282.5732 -282.3835 -282.3440 -282.3315 -282.2637 -282.2293 -282.0508 -35.5868 -35.1627 -34.9813 -30.4469 -29.5020 -28.9164 -27.9365 -27.3244 -27.0716 -26.9485 -26.6607 -25.7471 -24.9330 -23.5990 -23.2647 -23.0005 -22.5573 -22.0047 -21.6343 -21.1691 -20.8253 -20.6843 -20.4005 -19.5696 -19.0714 -19.0521 -18.7500 -18.7209 -18.5065 -18.2462 -18.1388 -18.0541 -17.8933 -17.5824 -17.4392 -17.3507 -17.2290 -17.1479 -16.5817 -16.3349 -16.2677 -15.9110 -15.7477 -15.5952 -15.4164 -15.0104 -14.8263 -14.7629 -14.5145 -14.0505 -13.7234 -12.4523 -11.3910 -1.1810 -0.9813 -0.7939 -0.1609 -0.1395 0.0362 0.3985 0.6815 0.7059 0.7620 0.8888 electronvolt
chargesum: 1.0000000
charge: 0.092339 0.105452 -0.317192 0.144912 0.164170 -0.040826 -0.224903 -0.197758 -0.145555 0.122686 -0.133706 0.121405 0.186659 0.137096 0.109671 0.461090 -0.251079 -0.249935 -0.195824 0.102994 0.097763 -0.197140 0.098920 0.083802 -0.112516 0.103697 0.068470 0.102232 0.068840 0.101565 0.084149 -0.388417 0.210139 -0.274454 0.215271 0.155745 -0.212018 0.142812 0.138379 0.134431 -0.211610 0.143148 0.138315 0.134634 0.182148
charge: -0.057885 0.040418 0.025245 0.027039 0.039733 -0.090109 -0.008031 0.001170 0.006233 0.020894 -0.013748 0.024952 -0.190957 0.029526 0.021064 -0.202666 -0.006089 -0.011993 -0.018228 0.037270 0.026040 -0.018061 0.035728 0.014759 -0.016510 0.027093 0.014346 0.025696 0.014137 0.023519 0.025562 0.337398 -0.132623 0.366526 -0.104312 0.438762 0.061202 0.029723 0.026522 0.024714 0.065763 0.023593 0.026458 0.027471 -0.037345
qa: 0.0923 0.1055 -0.3172 0.1449 0.1642 -0.0408 -0.2249 -0.1978 -0.1456 0.1227 -0.1337 0.1214 0.1867 0.1371 0.1097 0.4611 -0.2511 -0.2499 -0.1958 0.1030 0.0978 -0.1971 0.0989 0.0838 -0.1125 0.1037 0.0685 0.1022 0.0688 0.1016 0.0841 -0.3884 0.2101 -0.2745 0.2153 0.1557 -0.2120 0.1428 0.1384 0.1344 -0.2116 0.1431 0.1383 0.1346 0.1821
va: 3.6124 1.0195 3.9742 0.9792 1.0026 3.5374 4.0203 4.0564 4.0352 0.9989 3.9484 1.0079 4.0984 1.0103 1.0073 3.5338 4.0049 3.9976 3.9332 1.0056 1.0075 3.9464 1.0118 0.9974 3.8501 1.0100 1.0142 1.0098 1.0153 1.0090 1.0110 2.0813 1.0455 2.2251 1.0267 3.5156 3.8604 0.9949 0.9934 0.9940 3.8696 0.9958 0.9935 0.9970 1.0749
dispersion: -0.096295619 hartree
energy: -831.079842763494 hartree
dipole: 19.421166746 -16.630140628 2.791026118 0.884115955 -2.899776654 -2.015660698 0.399548648 -0.756129098 -0.356580451
dipolemethod: SCF
magnitude: 3.461194080 au
magnitude: 8.797656190 debye
quadrupole: 3154.051473000 -3207.644404215 -53.592931215 1875.111312066 -1938.127106378 -63.015794312 554.480196485 -631.041218638 -76.561022153 30.202529326 -42.275895442 -12.073366116 7.293860041 -0.074510691 7.219349350 -6.781489608 6.319430825 -0.462058783
zeropoint: 0.40978649 hartree
thermalvibcorrection: 0.01598526 hartree
thermalrotcorrection: 0.00141627 hartree
thermaltrasncorrection: 0.00141627 hartree
thermaltotal: -830.65123848 hartree
thermalcorr: 0.01881780 hartree
nonthermalcorr: 0.40978649 hartree
totalcorr: 0.42860429 hartree
totalenthalpy: -830.65029427 hartree
vibrat: 0.02737384 hartree
rotat: 0.01608471 hartree
total: 0.06370676 hartree
