program: Orca
programVersion: 6.0.1
elementType: C C C C C C H H H H O C H H H C C C C H H C H C H H H H H H O H C H H N C H H H C H H H H
charge: 1
multiplicity: 1
keywords: wB97X-D3BJ TightOpt Freq def2-TZVPP def2/J RIJCOSX TightSCF defgrid3 CHELPG
frequency: 0.00 0.00 0.00 0.00 0.00 0.00 34.91 41.94 73.19 86.46 108.97 120.67 140.64 177.13 212.85 216.30 221.75 229.18 259.28 272.65 287.24 293.86 312.12 332.84 343.08 365.33 384.22 405.98 425.16 444.00 459.59 473.19 481.89 500.07 519.13 576.55 638.35 652.75 678.80 722.71 737.42 806.38 826.23 830.60 863.61 878.19 887.95 903.16 927.90 937.26 950.02 984.43 990.75 1014.68 1021.00 1029.45 1036.22 1039.38 1074.77 1082.17 1096.51 1100.42 1111.53 1118.80 1136.55 1151.40 1168.47 1182.25 1195.12 1210.22 1216.99 1224.68 1242.05 1250.65 1273.65 1283.16 1299.42 1313.56 1331.36 1333.31 1341.53 1356.02 1384.85 1387.42 1396.81 1407.24 1411.13 1414.06 1424.63 1458.26 1474.50 1480.01 1484.84 1493.83 1495.89 1498.41 1501.57 1503.77 1507.39 1508.24 1511.99 1513.66 1514.35 1520.04 1528.47 1537.35 1558.62 1678.64 1687.89 3044.12 3054.95 3067.50 3068.53 3077.49 3085.39 3093.75 3103.10 3111.19 3113.25 3116.75 3117.01 3124.02 3130.82 3172.29 3184.98 3188.29 3189.78 3200.23 3208.20 3224.62 3226.83 3232.29 3236.31 3239.41 3868.15
frequency: 34.91 41.94 73.19 86.46 108.97 120.67 140.64 177.13 212.85 216.30 221.75 229.18 259.28 272.65 287.24 293.86 312.12 332.84 343.08 365.33 384.22 405.98 425.16 444.00 459.59 473.19 481.89 500.07 519.13 576.55 638.35 652.75 678.80 722.71 737.42 806.38 826.23 830.60 863.61 878.19 887.95 903.16 927.90 937.26 950.02 984.43 990.75 1014.68 1021.00 1029.45 1036.22 1039.38 1074.77 1082.17 1096.51 1100.42 1111.53 1118.80 1136.55 1151.40 1168.47 1182.25 1195.12 1210.22 1216.99 1224.68 1242.05 1250.65 1273.65 1283.16 1299.42 1313.56 1331.36 1333.31 1341.53 1356.02 1384.85 1387.42 1396.81 1407.24 1411.13 1414.06 1424.63 1458.26 1474.50 1480.01 1484.84 1493.83 1495.89 1498.41 1501.57 1503.77 1507.39 1508.24 1511.99 1513.66 1514.35 1520.04 1528.47 1537.35 1558.62 1678.64 1687.89 3044.12 3054.95 3067.50 3068.53 3077.49 3085.39 3093.75 3103.10 3111.19 3113.25 3116.75 3117.01 3124.02 3130.82 3172.29 3184.98 3188.29 3189.78 3200.23 3208.20 3224.62 3226.83 3232.29 3236.31 3239.41 3868.15
formula: C16H26NO2
InChI: InChI=1/C16H26NO2/c1-17(2)12-14-7-4-5-10-16(14,18)13-8-6-9-15(11-13)19-3/h6,8-9,11,14,17-18H,4-5,7,10,12H2,1-3H3
45 atoms
C  -3.442486 -0.13177 -0.735603
C  -2.899326 0.705359 0.247551
C  -1.526602 0.920801 0.292251
C  -0.684107 0.306904 -0.642046
C  -1.228816 -0.513415 -1.616189
C  -2.610455 -0.724878 -1.65682
H  -4.514314 -0.282224 -0.75554
H  -1.110167 1.57387 1.046279
H  -0.601736 -0.989813 -2.358245
H  -3.032663 -1.358655 -2.427916
O  -3.784742 1.255666 1.102682
C  -3.302318 2.151345 2.092171
H  -2.807306 3.012741 1.634793
H  -4.176422 2.487812 2.643884
H  -2.613434 1.648086 2.777495
C  0.8199 0.545146 -0.545409
C  1.159323 2.027763 -0.73582
C  1.375309 0.039283 0.806833
C  2.648046 2.322784 -0.564328
H  0.581786 2.607844 -0.012503
H  0.804061 2.336165 -1.724252
C  2.876651 0.316893 0.930837
H  0.875671 0.631053 1.579693
C  3.157584 1.811468 0.781195
H  2.814333 3.398002 -0.650915
H  3.216479 1.850307 -1.370149
H  3.234232 -0.045414 1.898962
H  3.428697 -0.215051 0.152489
H  4.228194 1.999906 0.878188
H  2.665342 2.356519 1.594389
O  1.519606 -0.231733 -1.542137
H  1.352839 0.140989 -2.411897
C  0.943548 -1.395142 1.11846
H  -0.140122 -1.429383 1.211036
H  1.384339 -1.745478 2.052469
N  1.308187 -2.397576 0.047465
C  0.243421 -3.425274 -0.117364
H  0.124432 -3.958148 0.824968
H  -0.683368 -2.925192 -0.389409
H  0.540631 -4.120377 -0.900558
C  2.627744 -3.042988 0.288186
H  3.386067 -2.278029 0.418914
H  2.555367 -3.6536 1.186915
H  2.874443 -3.670038 -0.566488
H  1.374416 -1.844926 -0.823801
totalener: -830.96750533207637 hartree
nucrepener: 1601.77357879218835 hartree
electener: -2432.74107830748471 hartree
oneelecener: -4288.97664144787814 hartree
twoeener: 1856.23556314039320 hartree
kineticenergy: 827.27100900289099 hartree
exchangeener: -77.128460412104 hartree
correlationener: -5.945440500851 hartree
xcener: -83.073900912955 hartree
dispersion: -0.097002403 hartree
temp: 298.15 k
press: 1.00 atm
thermalcorrenthalpy: 0.00094421 hartree
totalenthalpy: -830.63438736 hartree
vibrat: 0.02854829 hartree
rotat: 0.01594309 hartree
transl: 0.02024821 hartree
total: 0.06473960 hartree
totalentropycorr: -0.06473960 hartree
gibbsenthalpy: -830.69912695 hartree
gibbsminuselec: 0.36538078 hartree
dispersion: -0.097444334 hartree
dispersion: -0.097210277 hartree
dispersion: -0.097227444 hartree
dispersion: -0.097286246 hartree
dispersion: -0.097281944 hartree
dispersion: -0.097268697 hartree
energy: -526.9492 -526.4336 -399.1870 -284.9286 -284.7906 -284.7577 -284.7014 -284.2391 -283.6097 -283.4689 -283.0854 -282.7850 -282.6445 -282.6265 -282.5536 -282.5155 -282.3637 -282.3112 -282.2902 -35.7297 -35.5249 -34.9954 -30.4645 -29.8827 -28.4646 -27.9718 -27.7991 -27.0631 -26.8112 -26.3991 -25.6425 -25.3204 -23.9098 -23.7094 -22.7573 -22.6142 -22.1058 -22.0223 -20.9211 -20.8122 -20.6898 -19.8499 -19.6260 -19.3507 -19.1253 -18.9913 -18.7706 -18.6806 -18.5911 -18.3590 -18.1710 -18.0267 -17.9144 -17.7937 -17.3147 -17.2124 -16.9313 -16.6931 -16.5516 -16.3673 -16.0553 -15.8887 -15.6807 -15.5469 -15.1190 -14.8342 -14.7000 -14.6511 -14.2696 -13.9550 -12.4689 -11.5612 -1.3748 -0.9611 -0.8404 -0.2869 -0.1935 0.2205 0.4504 0.6277 0.6670 0.8118 0.9239 electronvolt
chargesum: 1.0000000
charge: -0.157250 0.198874 -0.280797 0.028453 -0.307252 -0.112045 0.140802 0.088498 0.123903 0.146714 -0.227629 -0.146976 0.108325 0.136383 0.094340 0.469598 -0.226868 -0.034182 -0.131979 0.097337 0.101833 -0.220807 0.104647 -0.164166 0.106323 0.078122 0.110063 0.084014 0.107116 0.084567 -0.391389 0.214316 -0.270982 0.171715 0.157262 0.121882 -0.216779 0.141642 0.143538 0.137308 -0.215150 0.145905 0.134409 0.139780 0.186581
charge: 0.010562 -0.200781 -0.018945 -0.077508 -0.043533 -0.004232 0.031057 0.012700 0.005984 0.027889 0.298695 -0.040783 0.005642 0.017757 0.001365 -0.202752 -0.002871 -0.062149 -0.013068 0.032591 0.030678 -0.014983 0.050604 -0.010851 0.026152 0.020207 0.023855 0.016861 0.025425 0.023801 0.341986 -0.118458 0.031883 0.036369 0.034415 0.445137 0.063703 0.027909 0.024500 0.025159 0.065885 0.021956 0.027288 0.025872 -0.022974
qa: -0.1573 0.1989 -0.2808 0.0285 -0.3073 -0.1120 0.1408 0.0885 0.1239 0.1467 -0.2276 -0.1470 0.1083 0.1364 0.0943 0.4696 -0.2269 -0.0342 -0.1320 0.0973 0.1018 -0.2208 0.1046 -0.1642 0.1063 0.0781 0.1101 0.0840 0.1071 0.0846 -0.3914 0.2143 -0.2710 0.1717 0.1573 0.1219 -0.2168 0.1416 0.1435 0.1373 -0.2152 0.1459 0.1344 0.1398 0.1866
va: 4.0111 4.0547 3.9956 3.3099 3.9976 4.0481 1.0127 1.0278 1.0326 0.9962 2.1804 3.8881 0.9855 0.9951 0.9854 3.6709 3.9588 3.8008 3.8798 1.0083 1.0141 3.9238 1.0109 3.9089 1.0093 1.0206 1.0029 1.0176 1.0054 1.0116 2.0601 1.0275 3.9318 0.9830 0.9963 3.5708 3.8501 0.9955 0.9998 0.9935 3.8581 0.9980 0.9963 0.9945 1.0616
dispersion: -0.097273716 hartree
energy: -831.064756820777 hartree
dipole: 14.773758901 -12.958920884 1.814838017 -4.313061002 2.096857925 -2.216203077 5.299370357 -4.918293359 0.381076998
dipolemethod: SCF
magnitude: 2.889708080 au
magnitude: 7.345054218 debye
quadrupole: 2800.119173406 -2870.083617049 -69.964443643 1619.903074898 -1677.718989810 -57.815914912 651.837246504 -726.277735599 -74.440489095 -339.651155962 331.482524291 -8.168631671 -55.120580739 54.302828037 -0.817752702 176.416200002 -173.168178358 3.248021643
zeropoint: 0.41010472 hartree
thermalvibcorrection: 0.01585795 hartree
thermalrotcorrection: 0.00141627 hartree
thermaltrasncorrection: 0.00141627 hartree
thermaltotal: -830.63596160 hartree
thermalcorr: 0.01869050 hartree
nonthermalcorr: 0.41010472 hartree
totalcorr: 0.42879522 hartree
totalenthalpy: -830.63501739 hartree
vibrat: 0.02716085 hartree
rotat: 0.01593737 hartree
total: 0.06334643 hartree
