program: Orca
programVersion: 6.0.1
elementType: C C C C C C H H H H O C H H H C C C C H H C H C H H H H H H O H C H H N C H H H C H H H H
charge: 1
multiplicity: 1
keywords: wB97X-D3BJ TightOpt Freq def2-TZVPP def2/J RIJCOSX TightSCF defgrid3 CHELPG
frequency: 0.00 0.00 0.00 0.00 0.00 0.00 30.87 49.14 65.49 74.29 98.25 101.63 144.20 172.57 198.55 213.24 217.68 225.46 238.64 271.59 273.85 288.15 290.82 303.71 320.40 335.54 366.54 374.89 414.64 443.77 457.96 479.64 493.14 519.99 528.52 580.34 587.46 655.24 659.59 714.55 745.75 816.55 831.12 837.91 864.67 882.83 898.26 916.83 927.81 938.27 976.70 988.03 989.19 1017.31 1023.39 1033.54 1037.06 1042.79 1065.68 1075.03 1097.10 1114.35 1114.47 1124.22 1133.88 1146.85 1171.25 1182.25 1196.57 1201.32 1212.26 1217.10 1234.88 1252.31 1269.86 1283.88 1304.80 1309.52 1331.71 1332.88 1345.70 1349.71 1353.74 1386.00 1398.84 1407.39 1412.89 1415.82 1426.11 1449.98 1459.52 1463.60 1482.18 1484.60 1491.64 1494.29 1495.74 1499.94 1502.66 1504.05 1507.49 1511.87 1513.24 1514.17 1518.99 1523.38 1549.43 1661.59 1690.52 3051.90 3054.15 3064.03 3067.68 3077.04 3091.78 3096.50 3103.86 3107.15 3114.29 3114.60 3122.41 3127.62 3129.33 3173.09 3188.36 3192.15 3194.61 3199.94 3211.09 3215.70 3218.80 3242.84 3250.40 3337.41 3879.62
frequency: 30.87 49.14 65.49 74.29 98.25 101.63 144.20 172.57 198.55 213.24 217.68 225.46 238.64 271.59 273.85 288.15 290.82 303.71 320.40 335.54 366.54 374.89 414.64 443.77 457.96 479.64 493.14 519.99 528.52 580.34 587.46 655.24 659.59 714.55 745.75 816.55 831.12 837.91 864.67 882.83 898.26 916.83 927.81 938.27 976.70 988.03 989.19 1017.31 1023.39 1033.54 1037.06 1042.79 1065.68 1075.03 1097.10 1114.35 1114.47 1124.22 1133.88 1146.85 1171.25 1182.25 1196.57 1201.32 1212.26 1217.10 1234.88 1252.31 1269.86 1283.88 1304.80 1309.52 1331.71 1332.88 1345.70 1349.71 1353.74 1386.00 1398.84 1407.39 1412.89 1415.82 1426.11 1449.98 1459.52 1463.60 1482.18 1484.60 1491.64 1494.29 1495.74 1499.94 1502.66 1504.05 1507.49 1511.87 1513.24 1514.17 1518.99 1523.38 1549.43 1661.59 1690.52 3051.90 3054.15 3064.03 3067.68 3077.04 3091.78 3096.50 3103.86 3107.15 3114.29 3114.60 3122.41 3127.62 3129.33 3173.09 3188.36 3192.15 3194.61 3199.94 3211.09 3215.70 3218.80 3242.84 3250.40 3337.41 3879.62
formula: C16H26NO2
InChI: InChI=1/C16H26NO2/c1-17(2)12-14-7-4-5-10-16(14,18)13-8-6-9-15(11-13)19-3/h6,8-9,11,14,17-18H,4-5,7,10,12H2,1-3H3
45 atoms
C  -3.03795 -0.221802 -0.889984
C  -2.546329 0.390222 0.264082
C  -1.198509 0.747191 0.338592
C  -0.331886 0.508265 -0.721156
C  -0.829175 -0.095085 -1.879716
C  -2.171583 -0.44926 -1.950905
H  -4.077511 -0.504706 -0.974562
H  -0.861011 1.222601 1.251874
H  -0.168901 -0.287101 -2.714027
H  -2.554744 -0.909585 -2.85424
O  -3.283519 0.663435 1.359663
C  -4.683112 0.404473 1.310703
H  -5.080993 0.736681 2.266051
H  -5.155375 0.967433 0.502044
H  -4.881444 -0.663316 1.184501
C  1.158886 0.826216 -0.57598
C  1.354927 2.317727 -0.272937
C  1.782174 -0.04007 0.54892
C  2.815685 2.682138 -0.024996
H  0.761083 2.581156 0.605427
H  0.935153 2.890873 -1.106266
C  3.243648 0.351184 0.809249
H  1.21591 0.149751 1.464392
C  3.388656 1.840127 1.110562
H  2.887763 3.745052 0.212515
H  3.404053 2.519633 -0.932258
H  3.627219 -0.241393 1.644477
H  3.840913 0.096342 -0.070573
H  4.441036 2.080496 1.271582
H  2.864018 2.077828 2.043005
O  1.862705 0.462077 -1.75886
H  1.796508 1.174014 -2.399405
C  1.760626 -1.530563 0.213685
H  2.363005 -2.095217 0.927012
H  2.170548 -1.677352 -0.784379
N  0.397483 -2.175816 0.2181
C  -0.160842 -2.328034 1.587858
H  -0.212793 -1.354549 2.065398
H  -1.161556 -2.748289 1.512731
H  0.486195 -2.996294 2.154066
C  0.427552 -3.478859 -0.49927
H  0.736029 -3.303762 -1.527632
H  1.13859 -4.136885 -0.002166
H  -0.567554 -3.918558 -0.47761
H  -0.223028 -1.547454 -0.307649
totalener: -830.96784791836376 hartree
nucrepener: 1608.03131118236274 hartree
electener: -2438.99916471422694 hartree
oneelecener: -4301.46057267111519 hartree
twoeener: 1862.46140795688848 hartree
kineticenergy: 827.26646929292349 hartree
exchangeener: -77.126955821921 hartree
correlationener: -5.945052364310 hartree
xcener: -83.072008186232 hartree
dispersion: -0.097592459 hartree
temp: 298.15 k
press: 1.00 atm
thermalcorrenthalpy: 0.00094421 hartree
totalenthalpy: -830.63644688 hartree
vibrat: 0.02718370 hartree
rotat: 0.01590932 hartree
transl: 0.02024821 hartree
total: 0.06334123 hartree
totalentropycorr: -0.06334123 hartree
gibbsenthalpy: -830.69978811 hartree
gibbsminuselec: 0.36565227 hartree
dispersion: -0.098127779 hartree
dispersion: -0.098044001 hartree
dispersion: -0.097905322 hartree
dispersion: -0.098039240 hartree
dispersion: -0.097997210 hartree
dispersion: -0.097993811 hartree
dispersion: -0.097997137 hartree
energy: -526.7516 -526.1889 -399.3233 -284.8200 -284.7868 -284.6935 -284.6655 -284.6005 -283.6547 -283.4437 -283.2759 -283.0239 -282.7983 -282.7753 -282.7179 -282.5055 -282.4858 -282.1437 -282.0982 -35.8202 -35.2679 -35.0033 -30.5930 -29.8452 -28.3455 -27.9812 -27.9135 -27.4901 -26.7197 -26.4051 -25.5243 -25.4115 -23.8732 -23.5211 -23.1447 -22.3934 -22.1456 -21.9209 -21.0178 -20.8604 -20.6407 -19.7630 -19.7081 -19.4506 -19.2133 -19.0441 -18.9876 -18.6519 -18.4667 -18.2655 -18.0917 -17.9539 -17.8446 -17.5716 -17.4055 -17.3145 -17.0137 -16.8167 -16.3985 -16.2556 -16.0907 -16.0685 -15.7321 -15.3283 -15.0122 -14.8909 -14.6823 -14.4214 -14.1904 -13.6671 -12.7545 -11.9160 -1.7313 -1.2224 -0.9290 -0.1968 0.0755 0.1243 0.3673 0.6096 0.8108 0.8702 0.9385 electronvolt
chargesum: 1.0000000
charge: -0.180708 0.225292 -0.337643 0.006955 -0.289740 -0.129792 0.133493 0.120639 0.154823 0.154532 -0.239711 -0.152817 0.133659 0.119268 0.100788 0.501227 -0.247556 -0.045010 -0.132577 0.098238 0.106389 -0.217250 0.096188 -0.151213 0.104514 0.079008 0.092943 0.108538 0.106510 0.078383 -0.359595 0.204408 -0.308703 0.149008 0.165694 0.159217 -0.221832 0.146261 0.140760 0.141120 -0.210120 0.144909 0.140111 0.137111 0.174284
charge: -0.019231 -0.211870 -0.007715 -0.078104 -0.032083 -0.003656 0.022155 0.025296 0.015157 0.030054 0.291038 -0.033263 0.016893 0.009624 0.003522 -0.222965 -0.005257 -0.061609 -0.013741 0.031352 0.029908 -0.003114 0.032048 -0.013327 0.025395 0.021040 0.023425 0.030467 0.025827 0.022380 0.318810 -0.123667 0.024423 0.034604 0.037378 0.447756 0.068099 0.022656 0.026857 0.027568 0.067056 0.027641 0.029534 0.026258 0.015381
qa: -0.1807 0.2253 -0.3376 0.0070 -0.2897 -0.1298 0.1335 0.1206 0.1548 0.1545 -0.2397 -0.1528 0.1337 0.1193 0.1008 0.5012 -0.2476 -0.0450 -0.1326 0.0982 0.1064 -0.2172 0.0962 -0.1512 0.1045 0.0790 0.0929 0.1085 0.1065 0.0784 -0.3596 0.2044 -0.3087 0.1490 0.1657 0.1592 -0.2218 0.1463 0.1408 0.1411 -0.2101 0.1449 0.1401 0.1371 0.1743
va: 3.8995 4.0175 3.9853 3.4497 3.9985 3.9866 1.0120 1.0324 1.0334 0.9995 2.1520 3.8833 0.9942 0.9849 0.9838 3.6826 3.9518 3.8086 3.8877 1.0075 1.0095 3.9528 1.0086 3.8902 1.0099 1.0215 1.0074 1.0140 1.0056 1.0106 2.1150 1.0365 3.9028 1.0020 1.0070 3.5926 3.8673 0.9934 0.9940 0.9993 3.8549 0.9940 0.9958 0.9944 1.0576
dispersion: -0.098000087 hartree
energy: -831.065709815326 hartree
dipole: 7.013875417 -7.172453795 -0.158578378 -6.168986434 3.773441155 -2.395545279 5.190310090 -4.832906911 0.357403179
dipolemethod: SCF
magnitude: 2.427245624 au
magnitude: 6.169568072 debye
quadrupole: 2915.356515448 -2977.029380142 -61.672864694 1385.468927211 -1447.953192859 -62.484265648 695.541579499 -772.127478320 -76.585898821 316.608787135 -314.300166850 2.308620285 -50.927529881 50.948175997 0.020646116 6.634805648 -9.092940106 -2.458134458
zeropoint: 0.40955045 hartree
thermalvibcorrection: 0.01620795 hartree
thermalrotcorrection: 0.00141627 hartree
thermaltrasncorrection: 0.00141627 hartree
thermaltotal: -830.63711887 hartree
thermalcorr: 0.01904049 hartree
nonthermalcorr: 0.40955045 hartree
totalcorr: 0.42859095 hartree
totalenthalpy: -830.63617466 hartree
vibrat: 0.02792480 hartree
rotat: 0.01589939 hartree
total: 0.06407241 hartree
