program: Orca
programVersion: 6.0.1
elementType: C C C C C C H H H H O C H H H C C C C H H C H C H H H H H H O H C H H N C H H H C H H H H
charge: 1
multiplicity: 1
keywords: wB97X-D3BJ TightOpt Freq def2-TZVPP def2/J RIJCOSX TightSCF defgrid3 CHELPG
frequency: 0.00 0.00 0.00 0.00 0.00 0.00 28.86 48.94 55.95 70.32 103.88 115.96 151.03 184.29 189.10 209.41 219.23 236.53 240.95 254.85 270.56 279.56 295.22 331.16 339.26 368.25 385.20 407.14 427.82 438.28 442.09 485.51 498.06 510.07 536.05 583.58 587.97 620.01 662.81 702.78 738.40 804.29 822.42 838.09 867.25 871.96 904.56 914.39 926.44 934.64 945.51 975.26 994.32 1004.54 1025.99 1030.47 1042.35 1044.60 1072.81 1077.25 1083.29 1101.78 1108.65 1130.66 1144.91 1164.21 1167.33 1181.36 1183.02 1206.28 1215.34 1217.91 1228.89 1268.09 1273.52 1284.35 1302.70 1311.99 1325.92 1336.14 1339.52 1352.93 1354.43 1382.96 1385.05 1404.07 1412.90 1421.18 1443.09 1461.44 1476.90 1485.45 1485.93 1490.23 1497.65 1500.83 1503.61 1506.68 1506.90 1509.78 1516.11 1517.25 1518.32 1525.09 1527.25 1533.36 1557.55 1672.13 1697.10 3051.88 3056.07 3074.25 3076.07 3088.86 3094.20 3099.99 3107.43 3117.36 3118.77 3120.88 3122.61 3123.41 3136.38 3178.12 3182.66 3188.27 3189.77 3197.55 3210.71 3214.45 3218.00 3221.14 3249.87 3257.07 3876.62
frequency: 28.86 48.94 55.95 70.32 103.88 115.96 151.03 184.29 189.10 209.41 219.23 236.53 240.95 254.85 270.56 279.56 295.22 331.16 339.26 368.25 385.20 407.14 427.82 438.28 442.09 485.51 498.06 510.07 536.05 583.58 587.97 620.01 662.81 702.78 738.40 804.29 822.42 838.09 867.25 871.96 904.56 914.39 926.44 934.64 945.51 975.26 994.32 1004.54 1025.99 1030.47 1042.35 1044.60 1072.81 1077.25 1083.29 1101.78 1108.65 1130.66 1144.91 1164.21 1167.33 1181.36 1183.02 1206.28 1215.34 1217.91 1228.89 1268.09 1273.52 1284.35 1302.70 1311.99 1325.92 1336.14 1339.52 1352.93 1354.43 1382.96 1385.05 1404.07 1412.90 1421.18 1443.09 1461.44 1476.90 1485.45 1485.93 1490.23 1497.65 1500.83 1503.61 1506.68 1506.90 1509.78 1516.11 1517.25 1518.32 1525.09 1527.25 1533.36 1557.55 1672.13 1697.10 3051.88 3056.07 3074.25 3076.07 3088.86 3094.20 3099.99 3107.43 3117.36 3118.77 3120.88 3122.61 3123.41 3136.38 3178.12 3182.66 3188.27 3189.77 3197.55 3210.71 3214.45 3218.00 3221.14 3249.87 3257.07 3876.62
formula: C16H26NO2
InChI: InChI=1/C16H26NO2/c1-17(2)12-14-7-4-5-10-16(14,18)13-8-6-9-15(11-13)19-3/h6,8-9,11,14,17-18H,4-5,7,10,12H2,1-3H3
45 atoms
C  -3.173995 1.931194 0.099261
C  -2.925811 0.566111 0.224688
C  -1.634781 0.080576 0.026558
C  -0.581736 0.930762 -0.290107
C  -0.840367 2.292958 -0.434603
C  -2.125486 2.776007 -0.235296
H  -4.163972 2.337877 0.248893
H  -1.496691 -0.990535 0.107755
H  -0.059535 2.987618 -0.705532
H  -2.317893 3.83656 -0.345198
O  -3.860911 -0.362896 0.52845
C  -5.196278 0.080785 0.733344
H  -5.254039 0.776453 1.574713
H  -5.594548 0.556028 -0.167098
H  -5.776622 -0.810342 0.959716
C  0.794351 0.317734 -0.543177
C  1.886844 1.332755 -0.896384
C  1.235133 -0.552886 0.658702
C  2.374315 2.171426 0.288878
H  1.534043 1.969647 -1.709717
H  2.730298 0.772178 -1.309103
C  1.661551 0.335984 1.835531
H  0.373053 -1.134513 0.987094
C  2.793562 1.291065 1.463057
H  1.585907 2.846424 0.626458
H  3.206895 2.797882 -0.037055
H  0.790652 0.915606 2.152132
H  1.942792 -0.295729 2.682025
H  3.70219 0.73311 1.211594
H  3.046899 1.910819 2.324835
O  0.660837 -0.59996 -1.670408
H  0.043991 -0.225272 -2.304029
C  2.361031 -1.528134 0.311906
H  2.763232 -1.993931 1.213235
H  3.177497 -1.029687 -0.205517
N  1.902952 -2.641711 -0.593758
C  1.110621 -3.674464 0.123189
H  0.275708 -3.20385 0.634555
H  0.736096 -4.396045 -0.600079
H  1.756605 -4.172782 0.84473
C  3.044191 -3.252957 -1.32339
H  3.754147 -3.650507 -0.599199
H  2.673708 -4.055583 -1.958122
H  3.520755 -2.488088 -1.933001
H  1.291455 -2.157221 -1.273962
totalener: -830.96535435819851 hartree
nucrepener: 1575.70338413750756 hartree
electener: -2406.66873224579740 hartree
oneelecener: -4237.47641971255780 hartree
twoeener: 1830.80768746676040 hartree
kineticenergy: 827.26455285167560 hartree
exchangeener: -77.128074035583 hartree
correlationener: -5.944408533188 hartree
xcener: -83.072482568771 hartree
dispersion: -0.095593050 hartree
temp: 298.15 k
press: 1.00 atm
thermalcorrenthalpy: 0.00094421 hartree
totalenthalpy: -830.63176746 hartree
vibrat: 0.02715549 hartree
rotat: 0.01603316 hartree
transl: 0.02024821 hartree
total: 0.06343686 hartree
totalentropycorr: -0.06343686 hartree
gibbsenthalpy: -830.69520432 hartree
gibbsminuselec: 0.36574309 hartree
dispersion: -0.095639476 hartree
dispersion: -0.095771973 hartree
dispersion: -0.096468046 hartree
dispersion: -0.096197272 hartree
dispersion: -0.095823429 hartree
dispersion: -0.095693896 hartree
dispersion: -0.095662547 hartree
dispersion: -0.095673171 hartree
dispersion: -0.095676952 hartree
dispersion: -0.095675575 hartree
energy: -526.7818 -526.1999 -399.1949 -284.8272 -284.8257 -284.8217 -284.8162 -283.9535 -283.4885 -283.1844 -282.8243 -282.6515 -282.5383 -282.3352 -282.3318 -282.2987 -282.2639 -282.1904 -282.1716 -35.5506 -35.2495 -34.9731 -30.3530 -29.7356 -28.3269 -27.9447 -27.5432 -27.0713 -26.8031 -26.2561 -25.5183 -25.0066 -23.7421 -23.6275 -22.8716 -22.6146 -21.9054 -21.3793 -21.1514 -20.7803 -20.5528 -20.0501 -19.5125 -19.2061 -19.0208 -18.7079 -18.6650 -18.4860 -18.3663 -18.3275 -18.1077 -17.9033 -17.7802 -17.5053 -17.3957 -17.1649 -16.8852 -16.6072 -16.4467 -16.1680 -16.0970 -15.7165 -15.4664 -15.2516 -15.0132 -14.6412 -14.5395 -14.3631 -14.2111 -13.8351 -12.2674 -11.2802 -1.2996 -0.9793 -0.5649 -0.0981 -0.0197 0.1304 0.3269 0.6140 0.6868 0.9465 0.9744 electronvolt
chargesum: 1.0000000
charge: -0.155630 0.175494 -0.173705 -0.199871 -0.143329 -0.151802 0.125322 0.079813 0.127329 0.142561 -0.248413 -0.149847 0.110094 0.110082 0.124957 0.624697 -0.260847 -0.047987 -0.164662 0.104054 0.089564 -0.224820 0.111378 -0.164468 0.094350 0.106056 0.117104 0.096221 0.072556 0.108519 -0.380479 0.214502 -0.320038 0.148719 0.152417 0.159147 -0.211237 0.139095 0.140976 0.135025 -0.215582 0.140793 0.137920 0.140051 0.183919
charge: -0.008806 -0.204025 -0.003045 -0.078121 -0.017385 0.006735 0.021292 0.017133 0.018946 0.028438 0.282570 -0.039306 0.006391 0.006396 0.013916 -0.183828 -0.009374 -0.062238 -0.009197 0.027045 0.021854 0.005432 0.027612 -0.015130 0.022322 0.025332 0.036600 0.024473 0.016702 0.027394 0.331409 -0.117840 0.023649 0.036420 0.028377 0.439072 0.064823 0.021833 0.026766 0.027893 0.062860 0.028944 0.026519 0.026611 -0.033466
qa: -0.1556 0.1755 -0.1737 -0.1999 -0.1433 -0.1518 0.1253 0.0798 0.1273 0.1426 -0.2484 -0.1498 0.1101 0.1101 0.1250 0.6247 -0.2608 -0.0480 -0.1647 0.1041 0.0896 -0.2248 0.1114 -0.1645 0.0944 0.1061 0.1171 0.0962 0.0726 0.1085 -0.3805 0.2145 -0.3200 0.1487 0.1524 0.1591 -0.2112 0.1391 0.1410 0.1350 -0.2156 0.1408 0.1379 0.1401 0.1839
va: 3.8909 4.1044 4.0732 3.6669 3.9742 4.0628 1.0128 1.0463 1.0103 1.0007 2.1482 3.8870 0.9845 0.9849 0.9952 3.3832 3.9869 3.8183 3.8562 1.0115 1.0081 3.9581 1.0047 3.8896 1.0150 1.0089 1.0060 1.0026 1.0097 1.0077 2.0556 1.0312 3.9530 1.0058 0.9793 3.5213 3.8659 0.9960 0.9929 0.9982 3.8609 0.9944 0.9935 0.9940 1.0708
dispersion: -0.095673774 hartree
energy: -831.061156279720 hartree
dipole: 13.397353018 -11.443217557 1.954135461 -7.744003221 5.072128930 -2.671874291 2.215150893 -2.749550038 -0.534399144
dipolemethod: SCF
magnitude: 3.353079192 au
magnitude: 8.522849984 debye
quadrupole: 3297.631262336 -3349.702405151 -52.071142814 1863.787854672 -1917.627828062 -53.839973390 475.644639346 -555.378539301 -79.733899955 -763.583170158 746.278190797 -17.304979361 -169.645596440 165.788714233 -3.856882207 178.745174022 -175.310943719 3.434230303
zeropoint: 0.40986657 hartree
thermalvibcorrection: 0.01609251 hartree
thermalrotcorrection: 0.00141627 hartree
thermaltrasncorrection: 0.00141627 hartree
thermaltotal: -830.63236466 hartree
thermalcorr: 0.01892505 hartree
nonthermalcorr: 0.40986657 hartree
totalcorr: 0.42879162 hartree
totalenthalpy: -830.63142045 hartree
vibrat: 0.02768661 hartree
rotat: 0.01603347 hartree
total: 0.06396829 hartree
