program: Orca
programVersion: 6.0.1
elementType: C C C C C C H H H H O C H H H C C C C H H C H C H H H H H H O H C H H N C H H H C H H H H
charge: 1
multiplicity: 1
keywords: wB97X-D3BJ TightOpt Freq def2-TZVPP def2/J RIJCOSX TightSCF defgrid3 CHELPG
frequency: 0.00 0.00 0.00 0.00 0.00 0.00 28.94 41.09 53.27 78.86 101.02 120.78 136.24 188.98 191.89 208.36 216.41 222.88 234.19 245.13 266.69 278.80 294.78 328.91 336.98 370.70 391.18 423.12 430.53 440.66 446.42 487.54 488.99 518.15 524.82 586.03 589.44 624.95 668.57 701.43 736.50 807.07 816.86 839.60 866.98 870.34 908.04 920.39 922.87 929.82 939.09 976.71 995.53 1003.97 1023.86 1025.60 1045.21 1049.72 1071.56 1077.04 1078.47 1103.42 1104.93 1134.23 1141.24 1163.82 1171.10 1183.09 1184.11 1205.11 1213.59 1221.00 1230.68 1258.90 1271.38 1277.69 1303.46 1314.30 1327.55 1336.61 1342.38 1347.67 1368.99 1379.05 1386.11 1400.77 1411.00 1421.68 1446.65 1462.56 1477.17 1485.17 1488.40 1490.45 1497.85 1501.78 1505.44 1506.15 1507.06 1510.35 1516.01 1517.35 1518.09 1526.26 1527.70 1533.95 1560.58 1672.01 1695.38 3051.28 3053.79 3071.69 3077.84 3078.44 3094.87 3098.83 3107.56 3109.04 3119.99 3122.88 3126.91 3137.29 3146.98 3177.92 3183.97 3184.48 3189.44 3198.01 3202.02 3211.16 3212.19 3220.07 3244.15 3251.57 3870.37
frequency: 28.94 41.09 53.27 78.86 101.02 120.78 136.24 188.98 191.89 208.36 216.41 222.88 234.19 245.13 266.69 278.80 294.78 328.91 336.98 370.70 391.18 423.12 430.53 440.66 446.42 487.54 488.99 518.15 524.82 586.03 589.44 624.95 668.57 701.43 736.50 807.07 816.86 839.60 866.98 870.34 908.04 920.39 922.87 929.82 939.09 976.71 995.53 1003.97 1023.86 1025.60 1045.21 1049.72 1071.56 1077.04 1078.47 1103.42 1104.93 1134.23 1141.24 1163.82 1171.10 1183.09 1184.11 1205.11 1213.59 1221.00 1230.68 1258.90 1271.38 1277.69 1303.46 1314.30 1327.55 1336.61 1342.38 1347.67 1368.99 1379.05 1386.11 1400.77 1411.00 1421.68 1446.65 1462.56 1477.17 1485.17 1488.40 1490.45 1497.85 1501.78 1505.44 1506.15 1507.06 1510.35 1516.01 1517.35 1518.09 1526.26 1527.70 1533.95 1560.58 1672.01 1695.38 3051.28 3053.79 3071.69 3077.84 3078.44 3094.87 3098.83 3107.56 3109.04 3119.99 3122.88 3126.91 3137.29 3146.98 3177.92 3183.97 3184.48 3189.44 3198.01 3202.02 3211.16 3212.19 3220.07 3244.15 3251.57 3870.37
formula: C16H26NO2
InChI: InChI=1/C16H26NO2/c1-17(2)12-14-7-4-5-10-16(14,18)13-8-6-9-15(11-13)19-3/h6,8-9,11,14,17-18H,4-5,7,10,12H2,1-3H3
45 atoms
C  -3.313399 1.337815 0.879544
C  -3.008844 1.137443 -0.46396
C  -1.741035 0.676841 -0.823786
C  -0.770322 0.404275 0.132713
C  -1.087601 0.595138 1.477875
C  -2.34367 1.061965 1.833302
H  -4.283092 1.701289 1.18813
H  -1.5542 0.550455 -1.88319
H  -0.374784 0.396066 2.264939
H  -2.57693 1.215018 2.880335
O  -3.859113 1.361433 -1.488121
C  -5.158141 1.852835 -1.181781
H  -5.708653 1.143909 -0.55738
H  -5.101829 2.822484 -0.679856
H  -5.666659 1.967179 -2.135826
C  0.558907 -0.178699 -0.351406
C  1.15371 0.624685 -1.513855
C  1.604226 -0.32854 0.776374
C  1.661898 1.993551 -1.067716
H  0.412245 0.726284 -2.304853
H  1.975337 0.048338 -1.949298
C  2.17152 1.040263 1.195499
H  1.107869 -0.771469 1.641633
C  2.723622 1.843816 0.01856
H  0.825247 2.586045 -0.685358
H  2.065231 2.531873 -1.927044
H  1.373156 1.617709 1.662982
H  2.938447 0.891783 1.960577
H  3.613227 1.359441 -0.399176
H  3.048363 2.823255 0.373966
O  0.282894 -1.530909 -0.831169
H  -0.632751 -1.574771 -1.117843
C  2.763067 -1.251586 0.392224
H  3.551453 -1.21155 1.14559
H  3.197107 -0.972147 -0.564986
N  2.347547 -2.693941 0.266674
C  2.154647 -3.350947 1.585262
H  1.784006 -4.361277 1.424475
H  3.111801 -3.384868 2.103834
H  1.432871 -2.787762 2.16986
C  3.295382 -3.460704 -0.582162
H  2.964146 -4.495563 -0.642476
H  3.312452 -3.018757 -1.576121
H  4.287556 -3.414513 -0.135336
H  1.431827 -2.634504 -0.214969
totalener: -830.96423157647257 hartree
nucrepener: 1568.77997163003579 hartree
electener: -2399.74420793577065 hartree
oneelecener: -4223.64229903171690 hartree
twoeener: 1823.89809109594603 hartree
kineticenergy: 827.26361547493707 hartree
exchangeener: -77.128377620431 hartree
correlationener: -5.944743051049 hartree
xcener: -83.073120671479 hartree
dispersion: -0.095526508 hartree
temp: 298.15 k
press: 1.00 atm
thermalcorrenthalpy: 0.00094421 hartree
totalenthalpy: -830.63158533 hartree
vibrat: 0.02519932 hartree
rotat: 0.01603194 hartree
transl: 0.02024821 hartree
total: 0.06147947 hartree
totalentropycorr: -0.06147947 hartree
gibbsenthalpy: -830.69306481 hartree
gibbsminuselec: 0.36669328 hartree
dispersion: -0.095567521 hartree
dispersion: -0.095685563 hartree
dispersion: -0.096335085 hartree
dispersion: -0.095905165 hartree
dispersion: -0.095742875 hartree
dispersion: -0.095620812 hartree
dispersion: -0.095360377 hartree
dispersion: -0.095643051 hartree
dispersion: -0.095625352 hartree
dispersion: -0.095599932 hartree
dispersion: -0.095600509 hartree
dispersion: -0.095598489 hartree
dispersion: -0.095601539 hartree
dispersion: -0.095600550 hartree
dispersion: -0.095598194 hartree
dispersion: -0.095599288 hartree
dispersion: -0.095601694 hartree
dispersion: -0.095599613 hartree
dispersion: -0.095598673 hartree
dispersion: -0.095598810 hartree
dispersion: -0.095598584 hartree
dispersion: -0.095598900 hartree
dispersion: -0.095599742 hartree
dispersion: -0.095602673 hartree
dispersion: -0.095600886 hartree
dispersion: -0.095601038 hartree
dispersion: -0.095601075 hartree
dispersion: -0.095600955 hartree
dispersion: -0.095601097 hartree
dispersion: -0.095658910 hartree
dispersion: -0.095600053 hartree
dispersion: -0.095602798 hartree
dispersion: -0.095601445 hartree
dispersion: -0.095598381 hartree
dispersion: -0.095600884 hartree
dispersion: -0.095599196 hartree
energy: -526.7572 -526.1739 -399.1570 -284.8289 -284.8240 -284.8091 -284.8083 -283.9742 -283.5364 -283.1394 -282.9039 -282.6767 -282.4701 -282.4002 -282.3150 -282.2843 -282.2667 -282.1976 -282.1745 -35.5358 -35.2438 -34.9450 -30.3649 -29.7593 -28.3275 -27.9298 -27.5400 -27.0532 -26.8346 -26.2610 -25.4929 -25.0150 -23.7060 -23.6065 -22.9589 -22.4342 -22.0836 -21.3591 -21.1398 -20.7979 -20.5431 -20.0355 -19.3998 -19.1519 -19.1410 -18.7805 -18.6708 -18.4500 -18.3345 -18.2974 -18.0855 -17.8731 -17.7764 -17.4727 -17.3505 -17.1964 -16.9014 -16.7001 -16.4866 -16.1618 -16.0746 -15.7069 -15.4759 -15.2304 -14.9657 -14.6494 -14.4778 -14.3382 -14.2737 -13.7449 -12.3199 -11.2889 -1.2226 -0.9824 -0.7272 -0.0808 0.0058 0.1792 0.4056 0.6755 0.7793 0.9050 1.1486 electronvolt
chargesum: 1.0000000
charge: -0.164219 0.177144 -0.240883 -0.083052 -0.193682 -0.146681 0.125399 0.121418 0.111039 0.139928 -0.241271 -0.151939 0.108237 0.110687 0.128422 0.589736 -0.245920 -0.020703 -0.142302 0.103742 0.085058 -0.223082 0.082450 -0.166383 0.095550 0.106216 0.111497 0.094502 0.073420 0.107469 -0.385492 0.219463 -0.333683 0.148129 0.153121 0.155451 -0.211712 0.139450 0.134359 0.142383 -0.215820 0.137293 0.140143 0.140675 0.184441
charge: -0.009600 -0.203137 -0.002343 -0.071621 -0.025981 0.005783 0.021213 0.023473 0.012953 0.027809 0.289168 -0.037316 0.005869 0.006729 0.015076 -0.180424 -0.007147 -0.060585 -0.006289 0.024700 0.019600 0.004378 0.025471 -0.014977 0.028462 0.025114 0.030721 0.023940 0.017046 0.027112 0.334330 -0.122903 0.024491 0.035888 0.027985 0.438454 0.064135 0.026565 0.027369 0.022342 0.062453 0.026470 0.026651 0.028722 -0.038148
qa: -0.1642 0.1771 -0.2409 -0.0831 -0.1937 -0.1467 0.1254 0.1214 0.1110 0.1399 -0.2413 -0.1519 0.1082 0.1107 0.1284 0.5897 -0.2459 -0.0207 -0.1423 0.1037 0.0851 -0.2231 0.0824 -0.1664 0.0955 0.1062 0.1115 0.0945 0.0734 0.1075 -0.3855 0.2195 -0.3337 0.1481 0.1531 0.1555 -0.2117 0.1394 0.1344 0.1424 -0.2158 0.1373 0.1401 0.1407 0.1844
va: 3.9141 4.1223 4.0274 3.6285 3.9761 4.0647 1.0125 1.0356 1.0116 1.0002 2.1578 3.8870 0.9845 0.9847 0.9950 3.5180 3.9858 3.8211 3.8560 1.0119 1.0067 3.9502 1.0154 3.8933 1.0122 1.0053 1.0127 1.0061 1.0103 1.0076 2.0477 1.0347 3.9803 1.0065 0.9817 3.5212 3.8672 0.9934 0.9972 0.9945 3.8633 0.9938 0.9935 0.9942 1.0725
dispersion: -0.095598581 hartree
energy: -831.059980155682 hartree
dipole: 15.442976391 -13.060541554 2.382434837 -5.995531248 3.187313286 -2.808217962 2.216705400 -1.557112365 0.659593034
dipolemethod: SCF
magnitude: 3.741276098 au
magnitude: 9.509568104 debye
quadrupole: 3546.759656422 -3592.573615805 -45.813959383 1696.856389671 -1754.525297926 -57.668908254 680.969016792 -758.452107207 -77.483090415 -1353.779216760 1330.145055657 -23.634161104 288.583523261 -286.150589538 2.432933723 -203.425113790 200.784301267 -2.640812523
zeropoint: 0.40976237 hartree
thermalvibcorrection: 0.01614012 hartree
thermalrotcorrection: 0.00141627 hartree
thermaltrasncorrection: 0.00141627 hartree
thermaltotal: -830.63124512 hartree
thermalcorr: 0.01897266 hartree
nonthermalcorr: 0.40976237 hartree
totalcorr: 0.42873503 hartree
totalenthalpy: -830.63030091 hartree
vibrat: 0.02786646 hartree
rotat: 0.01603265 hartree
total: 0.06414732 hartree
