program: Orca
programVersion: 6.0.1
elementType: C C C C C C H H H H O C H H H C C C C H H C H C H H H H H H O H C H H N C H H H C H H H H
charge: 1
multiplicity: 1
keywords: wB97X-D3BJ TightOpt Freq def2-TZVPP def2/J RIJCOSX TightSCF defgrid3 CHELPG
frequency: 0.00 0.00 0.00 0.00 0.00 0.00 29.75 46.55 66.49 70.86 96.46 112.77 138.80 166.85 199.78 212.79 217.47 229.12 239.88 266.91 283.68 288.43 293.48 306.41 324.31 335.96 367.07 394.00 433.46 446.09 459.14 466.90 488.08 503.05 528.45 575.15 584.48 653.83 659.01 710.54 745.18 816.66 837.87 845.37 867.23 882.38 897.90 908.71 921.71 950.51 976.56 988.11 992.24 1017.82 1025.09 1034.51 1039.53 1043.14 1065.82 1074.69 1093.25 1113.22 1113.83 1118.17 1132.04 1148.08 1169.71 1181.11 1190.63 1202.69 1215.02 1217.37 1237.37 1253.00 1270.46 1283.18 1299.01 1313.37 1327.51 1331.07 1335.48 1353.10 1378.69 1385.99 1398.10 1406.78 1412.83 1415.80 1425.87 1450.48 1457.57 1460.50 1474.10 1482.40 1491.40 1493.70 1495.63 1498.80 1502.34 1504.60 1507.68 1511.65 1512.02 1513.43 1518.69 1523.24 1553.96 1670.53 1682.93 3044.65 3049.84 3064.49 3068.14 3078.79 3088.43 3096.45 3103.21 3107.25 3112.96 3114.92 3116.15 3122.48 3129.66 3173.18 3187.61 3192.08 3194.37 3200.16 3211.65 3217.13 3233.91 3240.37 3242.62 3335.75 3877.93
frequency: 29.75 46.55 66.49 70.86 96.46 112.77 138.80 166.85 199.78 212.79 217.47 229.12 239.88 266.91 283.68 288.43 293.48 306.41 324.31 335.96 367.07 394.00 433.46 446.09 459.14 466.90 488.08 503.05 528.45 575.15 584.48 653.83 659.01 710.54 745.18 816.66 837.87 845.37 867.23 882.38 897.90 908.71 921.71 950.51 976.56 988.11 992.24 1017.82 1025.09 1034.51 1039.53 1043.14 1065.82 1074.69 1093.25 1113.22 1113.83 1118.17 1132.04 1148.08 1169.71 1181.11 1190.63 1202.69 1215.02 1217.37 1237.37 1253.00 1270.46 1283.18 1299.01 1313.37 1327.51 1331.07 1335.48 1353.10 1378.69 1385.99 1398.10 1406.78 1412.83 1415.80 1425.87 1450.48 1457.57 1460.50 1474.10 1482.40 1491.40 1493.70 1495.63 1498.80 1502.34 1504.60 1507.68 1511.65 1512.02 1513.43 1518.69 1523.24 1553.96 1670.53 1682.93 3044.65 3049.84 3064.49 3068.14 3078.79 3088.43 3096.45 3103.21 3107.25 3112.96 3114.92 3116.15 3122.48 3129.66 3173.18 3187.61 3192.08 3194.37 3200.16 3211.65 3217.13 3233.91 3240.37 3242.62 3335.75 3877.93
formula: C16H26NO2
InChI: InChI=1/C16H26NO2/c1-17(2)12-14-7-4-5-10-16(14,18)13-8-6-9-15(11-13)19-3/h6,8-9,11,14,17-18H,4-5,7,10,12H2,1-3H3
45 atoms
C  -3.020995 -0.530067 -1.088044
C  -2.643107 0.214703 0.037252
C  -1.332482 0.664845 0.16129
C  -0.389809 0.388904 -0.838497
C  -0.77763 -0.328968 -1.962247
C  -2.095947 -0.783662 -2.077167
H  -4.045577 -0.871218 -1.16521
H  -1.03957 1.233767 1.032439
H  -0.057481 -0.544632 -2.739397
H  -2.395066 -1.339656 -2.958014
O  -3.611618 0.432425 0.949418
C  -3.320305 1.269361 2.059778
H  -4.246742 1.354782 2.621702
H  -2.550451 0.825729 2.698899
H  -3.000287 2.261153 1.729636
C  1.073169 0.788765 -0.62903
C  1.191135 2.299772 -0.387862
C  1.668577 0.002618 0.568477
C  2.621364 2.736395 -0.084274
H  0.54368 2.580086 0.446396
H  0.79351 2.815789 -1.267947
C  3.097623 0.466172 0.883637
H  1.047088 0.213979 1.442814
C  3.167564 1.972569 1.117898
H  2.639354 3.811245 0.10496
H  3.261291 2.556392 -0.952196
H  3.459261 -0.069499 1.765779
H  3.75018 0.194953 0.049292
H  4.19972 2.264472 1.319436
H  2.586538 2.231316 2.010682
O  1.86034 0.405161 -1.750802
H  1.771344 1.065984 -2.441599
C  1.71828 -1.502707 0.308126
H  2.322306 -2.005784 1.064803
H  2.162995 -1.680818 -0.669746
N  0.382552 -2.203178 0.308382
C  -0.203809 -2.322113 1.669003
H  -1.194794 -2.763577 1.585934
H  0.442592 -2.958115 2.271994
H  -0.28228 -1.334447 2.112735
C  0.481162 -3.532619 -0.352657
H  0.803127 -3.38679 -1.381435
H  1.208327 -4.13908 0.185059
H  -0.495547 -4.011869 -0.331646
H  -0.246773 -1.623655 -0.261428
totalener: -830.96599347887400 hartree
nucrepener: 1617.55848476637061 hartree
electener: -2448.52447589705753 hartree
oneelecener: -4320.22690728567977 hartree
twoeener: 1871.70243138862224 hartree
kineticenergy: 827.26665471694230 hartree
exchangeener: -77.126725596513 hartree
correlationener: -5.945410987411 hartree
xcener: -83.072136583924 hartree
dispersion: -0.098061231 hartree
temp: 298.15 k
press: 1.00 atm
thermalcorrenthalpy: 0.00094421 hartree
totalenthalpy: -830.63511061 hartree
vibrat: 0.02709609 hartree
rotat: 0.01587374 hartree
transl: 0.02024821 hartree
total: 0.06321804 hartree
totalentropycorr: -0.06321804 hartree
gibbsenthalpy: -830.69832866 hartree
gibbsminuselec: 0.36572605 hartree
dispersion: -0.098800856 hartree
dispersion: -0.098594337 hartree
dispersion: -0.100471609 hartree
dispersion: -0.098785001 hartree
dispersion: -0.098533630 hartree
dispersion: -0.098538938 hartree
dispersion: -0.098533838 hartree
dispersion: -0.098593421 hartree
dispersion: -0.098559378 hartree
dispersion: -0.098551165 hartree
dispersion: -0.098555909 hartree
dispersion: -0.098553719 hartree
dispersion: -0.098536862 hartree
dispersion: -0.098530653 hartree
dispersion: -0.098529207 hartree
energy: -526.8100 -526.2361 -399.3556 -284.8538 -284.8396 -284.7425 -284.7250 -284.6444 -283.8089 -283.5197 -283.3352 -283.0050 -282.9183 -282.7572 -282.7159 -282.5695 -282.5657 -282.2175 -282.1625 -35.8999 -35.3081 -35.0553 -30.6314 -29.9028 -28.4046 -28.0763 -27.9755 -27.3863 -26.7996 -26.4797 -25.7617 -25.4042 -23.8954 -23.5896 -23.0046 -22.6076 -22.1852 -21.9971 -21.0837 -20.9139 -20.6878 -19.8442 -19.7724 -19.4631 -19.1921 -19.1130 -19.0952 -18.6891 -18.4985 -18.3713 -18.2264 -18.0126 -17.9042 -17.6293 -17.4640 -17.4017 -17.0310 -16.8466 -16.4728 -16.3030 -16.1559 -15.9545 -15.7832 -15.4274 -15.1424 -14.9736 -14.7288 -14.4872 -14.2238 -13.7065 -12.8320 -11.9482 -1.7460 -1.2553 -0.9641 -0.4615 -0.0246 0.1226 0.3250 0.5246 0.7371 0.8587 1.0325 electronvolt
chargesum: 1.0000000
charge: -0.163918 0.222833 -0.377058 -0.002868 -0.276925 -0.107012 0.145948 0.105480 0.153678 0.153236 -0.226571 -0.144308 0.140357 0.084995 0.116373 0.491417 -0.236418 -0.035491 -0.133854 0.089183 0.107197 -0.216556 0.089080 -0.150742 0.104261 0.081129 0.092456 0.110317 0.107468 0.075987 -0.358119 0.204108 -0.311644 0.149541 0.166202 0.159839 -0.210479 0.146954 0.141832 0.127542 -0.211059 0.144543 0.140188 0.139131 0.171750
charge: 0.004067 -0.209590 -0.026814 -0.076890 -0.030581 -0.005250 0.032055 0.013592 0.015062 0.030336 0.298917 -0.037896 0.019017 -0.001515 0.008665 -0.223985 -0.005743 -0.061687 -0.013381 0.028521 0.030052 -0.003145 0.030515 -0.013601 0.025165 0.021652 0.023296 0.030963 0.026114 0.021518 0.320280 -0.122897 0.025310 0.034679 0.037695 0.447846 0.066612 0.028226 0.027906 0.018904 0.067586 0.027559 0.029432 0.027048 0.014385
qa: -0.1639 0.2228 -0.3771 -0.0029 -0.2769 -0.1070 0.1459 0.1055 0.1537 0.1532 -0.2266 -0.1443 0.1404 0.0850 0.1164 0.4914 -0.2364 -0.0355 -0.1339 0.0892 0.1072 -0.2166 0.0891 -0.1507 0.1043 0.0811 0.0925 0.1103 0.1075 0.0760 -0.3581 0.2041 -0.3116 0.1495 0.1662 0.1598 -0.2105 0.1470 0.1418 0.1275 -0.2111 0.1445 0.1402 0.1391 0.1717
va: 3.9721 3.9908 3.9240 3.4408 3.9802 3.9827 1.0128 1.0246 1.0332 0.9972 2.1788 3.8847 0.9945 0.9830 0.9863 3.6964 3.9469 3.8018 3.8894 1.0089 1.0098 3.9534 1.0077 3.8898 1.0096 1.0220 1.0073 1.0138 1.0058 1.0106 2.1205 1.0364 3.9077 1.0019 1.0073 3.5948 3.8624 0.9928 1.0001 0.9987 3.8545 0.9943 0.9958 0.9942 1.0638
dispersion: -0.098527135 hartree
energy: -831.064335026383 hartree
dipole: 10.364129027 -9.889175658 0.474953370 -3.193660569 1.190631556 -2.003029013 8.448931162 -7.579257283 0.869673878
dipolemethod: SCF
magnitude: 2.234734567 au
magnitude: 5.680243852 debye
quadrupole: 2470.351923304 -2544.515856709 -74.163933406 1476.540805280 -1536.811273284 -60.270468004 804.497019689 -877.302881130 -72.805861441 289.601233891 -289.732851751 -0.131617860 -21.241159487 19.895956855 -1.345202632 73.395746215 -73.621554920 -0.225808705
zeropoint: 0.40952253 hartree
thermalvibcorrection: 0.01618551 hartree
thermalrotcorrection: 0.00141627 hartree
thermaltrasncorrection: 0.00141627 hartree
thermaltotal: -830.63579444 hartree
thermalcorr: 0.01901806 hartree
nonthermalcorr: 0.40952253 hartree
totalcorr: 0.42854058 hartree
totalenthalpy: -830.63485023 hartree
vibrat: 0.02790029 hartree
rotat: 0.01586319 hartree
total: 0.06401169 hartree
