program: Orca
programVersion: 6.0.1
elementType: C C C C C C H H H H O C H H H C C C C H H C H C H H H H H H O H C H H N C H H H C H H H H
charge: 1
multiplicity: 1
keywords: wB97X-D3BJ TightOpt Freq def2-TZVPP def2/J RIJCOSX TightSCF defgrid3 CHELPG
frequency: 0.00 0.00 0.00 0.00 0.00 0.00 38.78 50.68 83.65 100.97 102.42 108.58 140.27 162.17 196.63 204.87 212.55 220.18 248.05 256.15 277.47 282.18 291.44 317.04 333.90 367.39 373.71 408.18 418.85 439.51 462.96 491.57 501.93 521.26 534.23 584.70 600.73 654.62 675.58 739.82 743.06 773.05 815.97 825.37 857.13 875.51 913.58 920.72 926.66 930.20 961.83 979.71 989.49 1018.92 1023.05 1033.06 1038.53 1045.72 1063.78 1065.45 1097.10 1100.29 1121.60 1133.08 1135.16 1147.36 1182.82 1185.38 1194.55 1209.29 1211.19 1226.48 1228.04 1244.03 1271.83 1281.22 1291.15 1307.73 1330.09 1342.41 1345.00 1352.64 1360.35 1375.61 1390.04 1393.31 1413.62 1416.00 1423.26 1435.44 1459.58 1475.85 1483.99 1486.79 1492.77 1495.56 1503.22 1505.25 1506.67 1508.01 1514.12 1515.09 1516.05 1519.45 1524.86 1527.23 1549.94 1670.33 1694.92 3053.80 3071.64 3076.61 3080.33 3090.84 3096.86 3102.28 3109.62 3114.21 3115.85 3123.30 3126.56 3127.96 3140.30 3180.74 3186.16 3192.70 3195.85 3200.46 3205.87 3214.23 3216.68 3221.97 3251.70 3412.03 3874.40
frequency: 38.78 50.68 83.65 100.97 102.42 108.58 140.27 162.17 196.63 204.87 212.55 220.18 248.05 256.15 277.47 282.18 291.44 317.04 333.90 367.39 373.71 408.18 418.85 439.51 462.96 491.57 501.93 521.26 534.23 584.70 600.73 654.62 675.58 739.82 743.06 773.05 815.97 825.37 857.13 875.51 913.58 920.72 926.66 930.20 961.83 979.71 989.49 1018.92 1023.05 1033.06 1038.53 1045.72 1063.78 1065.45 1097.10 1100.29 1121.60 1133.08 1135.16 1147.36 1182.82 1185.38 1194.55 1209.29 1211.19 1226.48 1228.04 1244.03 1271.83 1281.22 1291.15 1307.73 1330.09 1342.41 1345.00 1352.64 1360.35 1375.61 1390.04 1393.31 1413.62 1416.00 1423.26 1435.44 1459.58 1475.85 1483.99 1486.79 1492.77 1495.56 1503.22 1505.25 1506.67 1508.01 1514.12 1515.09 1516.05 1519.45 1524.86 1527.23 1549.94 1670.33 1694.92 3053.80 3071.64 3076.61 3080.33 3090.84 3096.86 3102.28 3109.62 3114.21 3115.85 3123.30 3126.56 3127.96 3140.30 3180.74 3186.16 3192.70 3195.85 3200.46 3205.87 3214.23 3216.68 3221.97 3251.70 3412.03 3874.40
formula: C16H26NO2
InChI: InChI=1/C16H26NO2/c1-17(2)12-14-7-4-5-10-16(14,18)13-8-6-9-15(11-13)19-3/h6,8-9,11,14,17-18H,4-5,7,10,12H2,1-3H3
45 atoms
C  -3.1592 0.731127 0.850143
C  -2.762861 0.140681 -0.343861
C  -1.412814 0.162533 -0.718068
C  -0.458259 0.758696 0.088603
C  -0.862402 1.361756 1.283957
C  -2.196657 1.34364 1.648379
H  -4.194033 0.732532 1.160997
H  -1.156088 -0.289861 -1.668264
H  -0.14194 1.851619 1.927827
H  -2.504697 1.816495 2.573485
O  -3.59183 -0.482046 -1.209001
C  -4.985939 -0.472189 -0.921374
H  -5.363598 0.551364 -0.858679
H  -5.465741 -0.986933 -1.749936
H  -5.19849 -1.00264 0.010724
C  1.021128 0.751735 -0.300407
C  1.524967 2.180492 -0.510699
C  1.870336 0.040939 0.797939
C  2.978401 2.228911 -1.005785
H  1.426665 2.711254 0.438088
H  0.855261 2.691695 -1.208109
C  3.27677 0.656938 0.940815
H  1.350015 0.167719 1.747197
C  3.838365 1.103963 -0.405485
H  3.395803 3.202188 -0.740869
H  3.008509 2.171578 -2.0951
H  3.22184 1.514858 1.615046
H  3.944916 -0.062822 1.421804
H  3.866992 0.254022 -1.091404
H  4.868926 1.4396 -0.28452
O  1.213296 -0.010769 -1.504429
H  0.946625 0.522708 -2.257214
C  2.033827 -1.452711 0.526498
H  2.453577 -1.959808 1.396205
H  2.694121 -1.606455 -0.324184
N  0.748753 -2.158579 0.190575
C  -0.166312 -2.286225 1.358055
H  -1.094337 -2.744233 1.022635
H  0.315704 -2.91511 2.104878
H  -0.376756 -1.299603 1.760448
C  1.016867 -3.483288 -0.432048
H  1.595853 -3.330977 -1.340285
H  1.577951 -4.094289 0.273207
H  0.068947 -3.962746 -0.667966
H  0.294142 -1.572393 -0.516269
totalener: -830.96112658098991 hartree
nucrepener: 1605.42853367832322 hartree
electener: -2436.38966237925524 hartree
oneelecener: -4296.38584783760962 hartree
twoeener: 1859.99618545835415 hartree
kineticenergy: 827.25757868489177 hartree
exchangeener: -77.124876164477 hartree
correlationener: -5.945604736840 hartree
xcener: -83.070480901317 hartree
dispersion: -0.097618294 hartree
temp: 298.15 k
press: 1.00 atm
thermalcorrenthalpy: 0.00094421 hartree
totalenthalpy: -830.62832900 hartree
vibrat: 0.02867322 hartree
rotat: 0.01591614 hartree
transl: 0.02024821 hartree
total: 0.06483757 hartree
totalentropycorr: -0.06483757 hartree
gibbsenthalpy: -830.69316656 hartree
gibbsminuselec: 0.36557831 hartree
dispersion: -0.098049930 hartree
dispersion: -0.098005883 hartree
dispersion: -0.098007737 hartree
dispersion: -0.098014759 hartree
dispersion: -0.098012717 hartree
energy: -526.6634 -526.5695 -399.3135 -284.8417 -284.7974 -284.7431 -284.6483 -284.3637 -283.4902 -283.4823 -283.1349 -282.7601 -282.6528 -282.6337 -282.5735 -282.5136 -282.4826 -282.2302 -282.2242 -35.6278 -35.5578 -35.0505 -30.4329 -29.8719 -28.3461 -27.9387 -27.7675 -27.3188 -26.7177 -26.3126 -25.5287 -25.3361 -23.9690 -23.6104 -23.0411 -22.3664 -22.2302 -21.4506 -21.1415 -20.9228 -20.6534 -19.7244 -19.4959 -19.4344 -19.3396 -19.1000 -18.8110 -18.7210 -18.5145 -18.1754 -17.9965 -17.8627 -17.7818 -17.5559 -17.3957 -17.2320 -16.9023 -16.7869 -16.4547 -16.2148 -16.1108 -15.8988 -15.8335 -15.5482 -14.9676 -14.7946 -14.6880 -14.4536 -14.2981 -13.7897 -12.6064 -11.6384 -1.4507 -1.1064 -0.9252 -0.1956 0.0577 0.2481 0.4050 0.5847 0.7948 0.9338 1.0056 electronvolt
chargesum: 1.0000000
charge: -0.174221 0.195737 -0.233794 -0.067186 -0.300132 -0.129212 0.129244 0.127336 0.128459 0.149484 -0.244012 -0.150668 0.117132 0.129987 0.104037 0.539163 -0.271433 -0.064224 -0.161764 0.111308 0.115151 -0.164993 0.120418 -0.167866 0.104551 0.090335 0.104422 0.092798 0.080915 0.109273 -0.381750 0.207731 -0.314167 0.146237 0.171257 0.149535 -0.217671 0.138972 0.139291 0.146005 -0.212407 0.145461 0.139478 0.139767 0.182018
charge: -0.017108 -0.208853 -0.022141 -0.084648 -0.030346 0.006332 0.021193 0.015478 0.020223 0.030364 0.286366 -0.035379 0.008983 0.015406 0.004533 -0.208197 -0.004764 -0.053615 -0.008661 0.032605 0.031226 0.002807 0.031409 -0.012976 0.025431 0.018176 0.029457 0.026622 0.014314 0.023461 0.313737 -0.120178 0.014364 0.034238 0.034774 0.446095 0.072008 0.027102 0.026001 0.026516 0.068808 0.028065 0.029273 0.026631 0.014868
qa: -0.1742 0.1957 -0.2338 -0.0672 -0.3001 -0.1292 0.1292 0.1273 0.1285 0.1495 -0.2440 -0.1507 0.1171 0.1300 0.1040 0.5392 -0.2714 -0.0642 -0.1618 0.1113 0.1152 -0.1650 0.1204 -0.1679 0.1046 0.0903 0.1044 0.0928 0.0809 0.1093 -0.3817 0.2077 -0.3142 0.1462 0.1713 0.1495 -0.2177 0.1390 0.1393 0.1460 -0.2124 0.1455 0.1395 0.1398 0.1820
va: 3.9060 4.0878 3.9390 3.3367 4.0937 4.0296 1.0125 1.0469 1.0097 0.9977 2.1506 3.8826 0.9855 0.9946 0.9843 3.5923 3.9166 3.7197 3.8410 1.0057 1.0070 3.9041 0.9966 3.8797 1.0123 1.0125 1.0046 1.0057 1.0238 1.0068 2.0529 1.0317 3.9719 1.0028 0.9788 3.5904 3.8800 0.9922 1.0002 0.9982 3.8484 0.9945 0.9951 0.9931 1.0464
dispersion: -0.098011795 hartree
energy: -831.059020297327 hartree
dipole: 9.569055018 -9.069700990 0.499354027 -5.917012882 3.777606892 -2.139405990 2.794284910 -2.250429138 0.543855772
dipolemethod: SCF
magnitude: 2.263225913 au
magnitude: 5.752663100 debye
quadrupole: 3285.998692955 -3344.584952175 -58.586259220 1311.649961871 -1375.010475938 -63.360514067 549.255606319 -626.608811986 -77.353205666 202.066588287 -203.388533340 -1.321945052 43.136882152 -43.301310916 -0.164428764 -25.274436906 24.195157550 -1.079279356
zeropoint: 0.41025813 hartree
thermalvibcorrection: 0.01600992 hartree
thermalrotcorrection: 0.00141627 hartree
thermaltrasncorrection: 0.00141627 hartree
thermaltotal: -830.62991970 hartree
thermalcorr: 0.01884246 hartree
nonthermalcorr: 0.41025813 hartree
totalcorr: 0.42910059 hartree
totalenthalpy: -830.62897550 hartree
vibrat: 0.02751874 hartree
rotat: 0.01590805 hartree
total: 0.06367500 hartree
