program: Orca
programVersion: 6.0.1
elementType: C H C H H C C C C H C H C H H C C C C H H C H H C H H H H H H O H O H N C H H H C H H H H
charge: 1
multiplicity: 1
keywords: DLPNO-CCSD(T) def2-TZVPP def2-TZVPP/C VeryTightSCF
formula: C16H26NO2
InChI: InChI=1/C16H26NO2/c1-17(2)12-15(13-6-8-14(18)9-7-13)16(19)10-4-3-5-11-16/h6-9,15,17-19H,3-5,10-12H2,1-2H3
45 atoms
C  0.653621 -0.101092 -0.49449
H  0.709398 -0.003763 -1.581584
C  1.60384 -1.21747 -0.040438
H  2.567413 -1.184051 -0.546204
H  1.765866 -1.147462 1.033225
C  -0.777165 -0.451864 -0.135281
C  -1.154264 -0.765387 1.176302
C  -1.756592 -0.496273 -1.122953
C  -2.458641 -1.109818 1.484046
H  -0.424349 -0.702046 1.974363
C  -3.070846 -0.83238 -0.828461
H  -1.498301 -0.244012 -2.146824
C  -3.426676 -1.142446 0.48054
H  -2.751798 -1.340336 2.500609
H  -3.817403 -0.848267 -1.61539
C  1.138608 1.25751 0.073949
C  2.501731 1.637113 -0.526506
C  0.108457 2.349772 -0.232875
C  2.967671 3.023896 -0.080912
H  2.418529 1.622314 -1.618928
H  3.249953 0.893586 -0.241265
C  0.578322 3.737928 0.203927
H  -0.0726 2.357647 -1.313389
H  -0.835836 2.095142 0.250437
C  1.928703 4.091532 -0.414146
H  3.923345 3.254179 -0.55599
H  3.160204 3.018953 0.998021
H  -0.178129 4.475449 -0.070862
H  0.651139 3.785964 1.297861
H  2.26364 5.069819 -0.063878
H  1.819994 4.164561 -1.502046
O  1.262052 1.057273 1.485429
H  1.38628 1.906848 1.912387
O  -4.684433 -1.483436 0.844477
H  -5.278645 -1.441926 0.090819
N  1.023185 -2.578862 -0.305218
C  0.975014 -2.90329 -1.756868
H  0.523011 -3.884681 -1.884869
H  0.37661 -2.1538 -2.266866
H  1.992476 -2.906005 -2.144094
C  1.729489 -3.63565 0.468535
H  1.663789 -3.397841 1.527981
H  1.259676 -4.596852 0.269557
H  2.772086 -3.658388 0.156052
H  0.053915 -2.518884 0.027295
totalener: -825.31630280128934 hartree
nucrepener: 1572.31487716397601 hartree
electener: -2397.63117996526535 hartree
oneelecener: -4229.00608315084264 hartree
twoeener: 1831.37490318557730 hartree
kineticenergy: 824.61314243951415 hartree
energy: -562.9735 -562.3154 -430.8138 -311.0242 -311.0111 -310.8025 -310.5765 -310.2377 -309.4880 -309.0573 -308.9435 -308.9115 -308.7056 -308.5859 -308.1787 -308.0098 -307.8702 -307.8602 -307.6701 -41.1339 -40.3036 -40.1416 -34.8257 -33.4061 -32.5627 -31.3023 -30.9746 -30.6498 -30.2470 -30.1432 -28.8154 -27.4822 -26.2961 -25.7195 -25.4392 -24.6842 -24.1864 -23.4811 -23.0733 -22.6766 -22.2685 -21.7598 -21.2504 -21.0832 -20.2708 -20.1499 -19.9712 -19.7765 -19.6014 -19.4985 -19.2677 -19.1775 -19.1032 -18.9901 -18.9120 -18.6707 -18.4958 -18.0157 -17.4693 -17.3085 -17.1019 -16.8976 -16.5362 -16.3429 -16.2263 -16.0102 -15.4807 -15.1985 -14.5644 -14.1421 -12.5746 -11.6123 -0.2820 -0.0845 0.4412 0.4969 0.8462 1.0319 1.2552 1.3412 1.5105 1.5663 1.8349 electronvolt
chargesum: 1.0000000
charge: 0.294873 0.103914 -0.354210 0.130048 0.166989 -0.141883 -0.227835 -0.196279 -0.107946 0.130711 -0.144292 0.114528 0.279604 0.128262 0.095122 0.537518 -0.229864 -0.265675 -0.147261 0.061535 0.066637 -0.139084 0.060034 0.101914 -0.072159 0.079149 0.052383 0.081510 0.042505 0.084446 0.049219 -0.495170 0.212080 -0.375128 0.233833 0.161412 -0.135951 0.121698 0.117606 0.114364 -0.121038 0.120161 0.118247 0.114858 0.178616
charge: -0.052209 0.035733 0.042847 0.026117 0.032684 -0.101580 -0.001609 -0.004387 0.004174 0.025006 -0.017100 0.024300 -0.162834 0.029963 0.020043 -0.200174 -0.004184 0.001089 -0.010227 0.022817 0.015120 -0.010956 0.025686 0.025394 -0.011114 0.018874 0.013815 0.020378 0.011512 0.018135 0.017522 0.265570 -0.132665 0.328055 -0.099346 0.433012 0.088812 0.024160 0.021815 0.025426 0.085522 0.024803 0.023602 0.026881 0.029516
qa: 0.2949 0.1039 -0.3542 0.1300 0.1670 -0.1419 -0.2278 -0.1963 -0.1079 0.1307 -0.1443 0.1145 0.2796 0.1283 0.0951 0.5375 -0.2299 -0.2657 -0.1473 0.0615 0.0666 -0.1391 0.0600 0.1019 -0.0722 0.0791 0.0524 0.0815 0.0425 0.0844 0.0492 -0.4952 0.2121 -0.3751 0.2338 0.1614 -0.1360 0.1217 0.1176 0.1144 -0.1210 0.1202 0.1182 0.1149 0.1786
va: 3.3121 1.0096 3.9606 1.0053 1.0003 3.7132 3.9820 4.0749 3.9625 1.0290 3.9667 1.0123 4.0555 1.0142 1.0160 3.5461 3.9715 4.0089 3.9306 1.0136 1.0162 3.9219 1.0148 1.0039 3.8310 1.0146 1.0242 1.0166 1.0233 1.0149 1.0230 1.9306 1.0393 2.0704 1.0099 3.5205 3.8748 0.9988 1.0035 1.0042 3.8651 0.9995 0.9981 1.0011 1.0144
e0: -825.316302802 hartree
corrType: DLPNO BASED
energy: -828.932961201242 hartree
dipole: 16.936920873 -15.610044292 1.326876581 2.337852181 -5.151303870 -2.813451690 -5.738319611 4.449304540 -1.289015071
dipolemethod: SCF
magnitude: 3.367145932 au
magnitude: 8.558604795 debye
