program: Orca
programVersion: 6.0.1
elementType: C H C H H C C C C H C H C H H C C C C H H C H H C H H H H H H O H O H N C H H H C H H H H
charge: 1
multiplicity: 1
keywords: DLPNO-CCSD(T) def2-TZVPP def2-TZVPP/C VeryTightSCF
formula: C16H26NO2
InChI: InChI=1/C16H26NO2/c1-17(2)12-15(13-6-8-14(18)9-7-13)16(19)10-4-3-5-11-16/h6-9,15,17-19H,3-5,10-12H2,1-2H3
45 atoms
C  0.80088 -0.287794 -0.485921
H  0.988365 -0.457529 -1.549371
C  1.621571 -1.31409 0.29763
H  2.652612 -1.346774 -0.046185
H  1.618789 -1.099123 1.364524
C  -0.683035 -0.467957 -0.241404
C  -1.213063 -0.65142 1.040669
C  -1.56959 -0.491705 -1.315017
C  -2.568756 -0.843246 1.244079
H  -0.56463 -0.622435 1.910386
C  -2.932116 -0.673588 -1.129563
H  -1.191758 -0.350196 -2.322377
C  -3.438642 -0.850735 0.154988
H  -2.973799 -0.975068 2.239494
H  -3.600377 -0.677897 -1.984116
C  1.353557 1.138903 -0.234592
C  0.726071 2.112614 -1.237705
C  1.130313 1.652338 1.192525
C  1.243071 3.540965 -1.061351
H  -0.358294 2.106869 -1.095345
H  0.928155 1.753673 -2.250832
C  1.660761 3.076591 1.374695
H  0.057877 1.651886 1.401672
H  1.612063 0.986025 1.913265
C  1.026393 4.034029 0.367909
H  0.741425 4.197293 -1.775022
H  2.309586 3.591718 -1.312601
H  1.461081 3.407231 2.395861
H  2.75119 3.088502 1.263749
H  1.435571 5.03884 0.489925
H  -0.049005 4.103087 0.565698
O  2.7535 0.980692 -0.49697
H  3.174474 1.842267 -0.485982
O  -4.752632 -1.039091 0.413463
H  -5.267391 -1.000153 -0.396763
N  1.048165 -2.69832 0.151211
C  1.166415 -3.220654 -1.239122
H  0.764702 -4.231307 -1.269618
H  0.600698 -2.579661 -1.908859
H  2.218816 -3.225129 -1.517124
C  1.64696 -3.63992 1.136333
H  1.182259 -4.617429 1.024098
H  2.715915 -3.709868 0.942925
H  1.475357 -3.256754 2.139953
H  0.048625 -2.600218 0.356094
totalener: -825.31486355821653 hartree
nucrepener: 1573.58773649656814 hartree
electener: -2398.90260005478467 hartree
oneelecener: -4231.39362435811472 hartree
twoeener: 1832.49102430333005 hartree
kineticenergy: 824.61428009293309 hartree
energy: -563.0599 -562.2487 -430.8617 -311.0644 -310.9927 -310.7902 -310.6790 -310.1990 -309.4378 -309.1766 -309.1248 -309.0558 -308.7965 -308.7272 -308.1113 -308.0005 -307.8701 -307.8372 -307.6585 -41.2267 -40.2710 -40.1079 -34.9452 -33.3676 -32.5797 -31.3106 -31.1135 -30.6654 -30.2390 -30.1254 -28.8955 -27.5389 -26.3902 -25.7318 -25.5576 -24.7116 -24.1159 -23.4037 -23.1742 -22.6744 -22.3574 -21.8185 -21.3390 -20.8200 -20.3458 -20.1227 -20.0042 -19.9027 -19.6944 -19.5029 -19.3357 -19.2575 -19.1656 -19.0656 -18.9699 -18.6548 -18.5608 -18.0987 -17.3621 -17.1545 -16.9792 -16.9261 -16.6871 -16.4659 -16.2194 -16.0076 -15.4774 -15.1736 -14.5683 -14.1558 -12.6933 -11.6973 -0.3528 -0.1643 0.3125 0.7038 0.7375 0.9412 1.2794 1.3232 1.4085 1.5970 1.8332 electronvolt
chargesum: 1.0000000
charge: 0.286833 0.096866 -0.320249 0.159121 0.123829 -0.058080 -0.299853 -0.226311 -0.097781 0.123626 -0.115303 0.120278 0.251163 0.129459 0.096614 0.547221 -0.250105 -0.252608 -0.144994 0.067104 0.080227 -0.156245 0.063194 0.067581 -0.073456 0.080235 0.046040 0.078401 0.051520 0.083386 0.051198 -0.470840 0.213445 -0.374423 0.234732 0.163244 -0.139371 0.121190 0.119141 0.120657 -0.123843 0.118580 0.118891 0.116137 0.173549
charge: -0.054049 0.038052 0.043523 0.033864 0.024137 -0.102323 -0.015418 0.003411 0.004026 0.022693 -0.012468 0.028117 -0.162382 0.029839 0.021210 -0.198333 -0.000828 -0.003940 -0.010364 0.026875 0.020075 -0.009124 0.025371 0.012255 -0.010293 0.019858 0.011656 0.018962 0.012479 0.017958 0.018106 0.261526 -0.133439 0.329277 -0.098367 0.433301 0.091517 0.023342 0.021907 0.027700 0.085415 0.023390 0.028319 0.023191 0.029976
qa: 0.2868 0.0969 -0.3202 0.1591 0.1238 -0.0581 -0.2999 -0.2263 -0.0978 0.1236 -0.1153 0.1203 0.2512 0.1295 0.0966 0.5472 -0.2501 -0.2526 -0.1450 0.0671 0.0802 -0.1562 0.0632 0.0676 -0.0735 0.0802 0.0460 0.0784 0.0515 0.0834 0.0512 -0.4708 0.2134 -0.3744 0.2347 0.1632 -0.1394 0.1212 0.1191 0.1207 -0.1238 0.1186 0.1189 0.1161 0.1735
va: 3.3227 1.0251 3.9859 1.0183 0.9909 3.5580 3.9497 4.0698 3.9897 1.0043 3.9487 1.0115 4.0871 1.0116 1.0138 3.6067 4.0036 4.0109 3.9263 1.0132 1.0107 3.9474 1.0137 1.0054 3.8417 1.0157 1.0240 1.0147 1.0238 1.0150 1.0213 1.9467 1.0368 2.0716 1.0093 3.5093 3.8735 0.9980 1.0009 1.0026 3.8650 0.9985 1.0010 0.9985 1.0145
e0: -825.314863559 hartree
corrType: DLPNO BASED
energy: -828.931803403644 hartree
dipole: 14.056698702 -13.060991848 0.995706853 0.966684724 -4.043160560 -3.076475837 0.157070100 -0.450033779 -0.292963678
dipolemethod: SCF
magnitude: 3.246838990 au
magnitude: 8.252808852 debye
