program: Orca
programVersion: 6.0.1
elementType: C C C C C C H H H H O C H H H C C C C H H C H C H H H H H H O H C H H N C H H H C H H H H
charge: 1
multiplicity: 1
keywords: DLPNO-CCSD(T) def2-TZVPP def2-TZVPP/C VeryTightSCF
formula: C16H26NO2
InChI: InChI=1/C16H26NO2/c1-17(2)12-14-7-4-5-10-16(14,18)13-8-6-9-15(11-13)19-3/h6,8-9,11,14,17-18H,4-5,7,10,12H2,1-3H3
45 atoms
C  -3.185539 1.012184 0.911329
C  -2.850735 0.269544 -0.212591
C  -1.515661 0.190784 -0.620783
C  -0.515279 0.84177 0.078098
C  -0.858077 1.5901 1.20678
C  -2.177577 1.667279 1.607709
H  -4.208986 1.09342 1.246431
H  -1.306644 -0.390378 -1.508931
H  -0.102836 2.12123 1.77187
H  -2.436686 2.252434 2.480659
O  -3.725932 -0.417212 -0.971246
C  -5.10426 -0.334423 -0.652795
H  -5.621065 -0.931041 -1.398473
H  -5.306418 -0.742112 0.340453
H  -5.458599 0.697203 -0.705954
C  0.945519 0.736707 -0.352135
C  1.515002 2.11808 -0.693943
C  1.79968 0.056941 0.746957
C  3.001732 2.089235 -1.031225
H  1.341706 2.781105 0.155838
H  0.928729 2.533775 -1.518806
C  3.282063 0.022304 0.364876
H  1.711279 0.691302 1.633733
C  3.805431 1.426975 0.081733
H  3.351567 3.108137 -1.198772
H  3.162778 1.548093 -1.967054
H  3.852959 -0.441731 1.1730
H  3.431469 -0.584701 -0.531311
H  4.860871 1.381141 -0.187637
H  3.741617 2.029597 0.993478
O  1.077305 -0.126215 -1.497263
H  0.738247 0.313245 -2.279178
C  1.213554 -1.278883 1.2071
H  0.23207 -1.106753 1.643685
H  1.846582 -1.746076 1.961394
N  1.014767 -2.288198 0.100682
C  -0.236648 -3.065682 0.289913
H  -1.078458 -2.377889 0.302763
H  -0.34558 -3.769929 -0.531261
H  -0.17721 -3.605103 1.233058
C  2.177642 -3.194977 -0.071192
H  2.01281 -3.821111 -0.94453
H  3.079707 -2.607821 -0.204945
H  2.269836 -3.817423 0.816395
H  0.918751 -1.719818 -0.757999
totalener: -825.30936931543738 hartree
nucrepener: 1597.10675640481986 hartree
electener: -2422.41612572025724 hartree
oneelecener: -4278.16798053991351 hartree
twoeener: 1855.75185481965627 hartree
kineticenergy: 824.68875200849527 hartree
energy: -563.3229 -562.8065 -430.3601 -310.8845 -310.7325 -310.7276 -310.6660 -310.3682 -309.4180 -309.4104 -309.0490 -308.6764 -308.6047 -308.4561 -308.4247 -308.3249 -308.2793 -308.1608 -308.0918 -41.2857 -41.2384 -39.7611 -34.6295 -33.8551 -31.9872 -31.5107 -30.9842 -30.7720 -30.0893 -29.5000 -28.3490 -28.2680 -26.5084 -26.1599 -25.4755 -24.5852 -24.2936 -23.8859 -22.7030 -22.2592 -22.1460 -21.6272 -21.1907 -20.9838 -20.8123 -20.5051 -20.4070 -20.0686 -19.9229 -19.6017 -19.3628 -19.2952 -19.1630 -18.9227 -18.7222 -18.4190 -18.2110 -17.7970 -17.6152 -17.4781 -17.2353 -17.0016 -16.8899 -16.5371 -16.2761 -15.9907 -15.6325 -15.5920 -15.0309 -14.9036 -12.2450 -11.4081 -0.0316 0.3152 0.5997 0.6934 0.8506 1.1260 1.4264 1.5374 1.7588 1.8264 1.8980 electronvolt
chargesum: 1.0000000
charge: -0.175768 0.296222 -0.315411 0.066207 -0.301140 -0.090226 0.109256 0.103964 0.096436 0.121527 -0.376383 -0.021054 0.102003 0.073264 0.083920 0.617208 -0.211455 0.030679 -0.092267 0.079120 0.081429 -0.201067 0.091383 -0.123545 0.089320 0.054182 0.092570 0.058586 0.089939 0.061484 -0.503377 0.223401 -0.223937 0.154545 0.140768 0.097681 -0.139155 0.124581 0.115667 0.114198 -0.131177 0.116293 0.119324 0.109200 0.191605
charge: -0.019675 -0.184916 -0.018992 -0.063210 -0.028003 0.014980 0.019010 0.013111 0.015512 0.029086 0.238021 -0.015272 0.011976 0.002311 0.005892 -0.176749 0.005093 -0.051648 -0.005143 0.029446 0.025567 -0.007471 0.046305 -0.003337 0.021605 0.015982 0.019268 0.013002 0.020583 0.019388 0.303173 -0.118420 0.047845 0.033496 0.031003 0.434933 0.078652 0.022473 0.021926 0.024095 0.079918 0.022257 0.019436 0.023769 -0.016278
qa: -0.1758 0.2962 -0.3154 0.0662 -0.3011 -0.0902 0.1093 0.1040 0.0964 0.1215 -0.3764 -0.0211 0.1020 0.0733 0.0839 0.6172 -0.2115 0.0307 -0.0923 0.0791 0.0814 -0.2011 0.0914 -0.1235 0.0893 0.0542 0.0926 0.0586 0.0899 0.0615 -0.5034 0.2234 -0.2239 0.1545 0.1408 0.0977 -0.1392 0.1246 0.1157 0.1142 -0.1312 0.1163 0.1193 0.1092 0.1916
va: 3.9505 4.0386 3.9227 3.2991 4.1421 4.0139 1.0148 1.0449 1.0170 1.0069 1.9330 3.8759 1.0001 0.9904 0.9924 3.5061 3.9587 3.7919 3.8767 1.0176 1.0217 3.9433 1.0173 3.8987 1.0162 1.0276 1.0088 1.0199 1.0127 1.0220 1.8829 1.0161 3.9509 0.9844 1.0004 3.5186 3.8823 0.9918 0.9994 1.0012 3.8785 1.0001 0.9988 1.0028 1.0454
e0: -825.309369316 hartree
corrType: DLPNO BASED
energy: -828.923555959209 hartree
dipole: 10.795228399 -9.875655205 0.919573194 -6.868460161 4.606629759 -2.261830403 2.014261456 -1.582240467 0.432020988
dipolemethod: SCF
magnitude: 2.479543055 au
magnitude: 6.302497579 debye
