program: Orca
programVersion: 6.0.1
elementType: C C C C C C H H H H O C H H H C C C C H H C H C H H H H H H O H C H H N C H H H C H H H H
charge: 1
multiplicity: 1
keywords: DLPNO-CCSD(T) def2-TZVPP def2-TZVPP/C VeryTightSCF
formula: C16H26NO2
InChI: InChI=1/C16H26NO2/c1-17(2)12-14-7-4-5-10-16(14,18)13-8-6-9-15(11-13)19-3/h6,8-9,11,14,17-18H,4-5,7,10,12H2,1-3H3
45 atoms
C  -3.062299 -0.465909 -1.082956
C  -2.669131 0.263969 0.044444
C  -1.347461 0.675665 0.173882
C  -0.408361 0.377079 -0.820479
C  -0.813106 -0.330073 -1.944301
C  -2.141215 -0.746192 -2.065307
H  -4.095071 -0.776303 -1.166481
H  -1.045519 1.238758 1.045916
H  -0.099114 -0.559296 -2.722609
H  -2.451543 -1.291177 -2.947726
O  -3.631135 0.508883 0.948194
C  -3.329089 1.315119 2.070403
H  -4.255946 1.415266 2.626726
H  -2.577548 0.84314 2.709695
H  -2.982378 2.304781 1.764107
C  1.062411 0.764427 -0.62231
C  1.186163 2.27942 -0.40812
C  1.667693 -0.007021 0.58333
C  2.609847 2.725859 -0.100624
H  0.530476 2.578606 0.412369
H  0.794542 2.778766 -1.299514
C  3.088291 0.476056 0.904943
H  1.040631 0.198384 1.455422
C  3.152068 1.983874 1.11356
H  2.620962 3.80235 0.072065
H  3.257665 2.540961 -0.960974
H  3.445477 -0.042035 1.797967
H  3.753144 0.194093 0.084384
H  4.181529 2.281132 1.314716
H  2.570257 2.256937 2.000414
O  1.836146 0.359218 -1.739392
H  1.769579 1.015152 -2.434453
C  1.746198 -1.512213 0.335549
H  2.336715 -1.999763 1.112162
H  2.226234 -1.688072 -0.625613
N  0.427655 -2.237281 0.295381
C  -0.200423 -2.36742 1.632498
H  -1.184746 -2.814026 1.517767
H  0.427963 -3.000404 2.255626
H  -0.302225 -1.383689 2.079316
C  0.565435 -3.557654 -0.368542
H  0.912684 -3.402611 -1.386679
H  1.285737 -4.158395 0.182766
H  -0.401974 -4.053335 -0.379449
H  -0.19441 -1.666143 -0.291447
totalener: -825.30594856634229 hartree
nucrepener: 1617.55848476637061 hartree
electener: -2442.86443333271291 hartree
oneelecener: -4318.52195004074383 hartree
twoeener: 1875.65751670803093 hartree
kineticenergy: 824.68853156504952 hartree
energy: -563.1262 -562.7025 -430.5782 -310.8523 -310.8515 -310.7742 -310.7535 -310.7252 -309.7985 -309.3959 -309.3294 -309.0272 -308.8074 -308.6588 -308.6072 -308.4570 -308.4497 -308.0865 -308.0357 -41.6171 -40.7843 -40.0209 -34.8545 -33.8698 -31.9985 -31.7450 -31.1734 -30.9333 -30.1507 -29.6426 -28.7756 -28.1881 -26.5772 -26.1134 -25.4690 -24.9374 -24.1017 -24.0326 -22.8944 -22.4715 -22.1868 -21.6179 -21.5061 -21.1924 -20.8687 -20.7703 -20.4999 -20.0247 -19.8860 -19.7810 -19.4889 -19.2087 -19.0585 -18.9768 -18.8767 -18.6339 -18.3410 -17.7928 -17.5804 -17.5145 -17.2901 -17.1508 -17.0149 -16.6312 -16.4170 -15.9855 -15.8534 -15.5280 -15.0283 -14.7655 -12.5817 -11.8223 -0.2948 0.0102 0.3503 0.4885 0.8065 0.9664 1.2621 1.4635 1.6374 1.7877 1.8962 electronvolt
chargesum: 1.0000000
charge: -0.182663 0.320952 -0.449921 0.096023 -0.319375 -0.047290 0.127240 0.088042 0.149623 0.129053 -0.355184 -0.012754 0.114590 0.052528 0.082237 0.626983 -0.214374 0.041611 -0.097963 0.066867 0.089269 -0.198306 0.063481 -0.104931 0.087706 0.058491 0.074313 0.089463 0.091354 0.051290 -0.471271 0.213979 -0.289155 0.131586 0.151684 0.168969 -0.138231 0.123449 0.118903 0.107645 -0.132598 0.120964 0.115487 0.117322 0.142908
charge: 0.002970 -0.182405 -0.029334 -0.064469 -0.033638 0.002327 0.030009 0.012012 0.014237 0.029337 0.253030 -0.017052 0.016116 -0.003657 0.005562 -0.198651 0.001890 -0.051996 -0.005497 0.024490 0.025274 0.004404 0.025301 -0.006119 0.020698 0.017728 0.018670 0.027008 0.021497 0.016678 0.284621 -0.122220 0.039403 0.031400 0.035883 0.436758 0.080597 0.024768 0.024284 0.016800 0.082058 0.024358 0.026016 0.023750 0.015104
qa: -0.1827 0.3210 -0.4499 0.0960 -0.3194 -0.0473 0.1272 0.0880 0.1496 0.1291 -0.3552 -0.0128 0.1146 0.0525 0.0822 0.6270 -0.2144 0.0416 -0.0980 0.0669 0.0893 -0.1983 0.0635 -0.1049 0.0877 0.0585 0.0743 0.0895 0.0914 0.0513 -0.4713 0.2140 -0.2892 0.1316 0.1517 0.1690 -0.1382 0.1234 0.1189 0.1076 -0.1326 0.1210 0.1155 0.1173 0.1429
va: 4.0008 3.9430 3.9630 3.3919 4.0043 3.9567 1.0183 1.0190 1.0255 1.0067 1.9742 3.8743 1.0011 0.9870 0.9932 3.5358 3.9491 3.7764 3.8871 1.0155 1.0184 3.9645 1.0159 3.8713 1.0165 1.0288 1.0131 1.0171 1.0133 1.0210 1.9400 1.0254 3.9425 1.0054 1.0033 3.5228 3.8837 0.9999 1.0053 0.9962 3.8737 0.9993 1.0011 0.9994 1.0861
e0: -825.305948567 hartree
corrType: DLPNO BASED
energy: -828.921107588970 hartree
dipole: 10.618556352 -9.998969562 0.619586789 -3.330162321 1.244040895 -2.086121425 8.335311658 -7.492990663 0.842320994
dipolemethod: SCF
magnitude: 2.333515598 au
magnitude: 5.931325281 debye
