program: Gaussian 09
title: 000076772
version: EM64L-G09RevD.01
frameworkgroup: C1[X(C6H7NO)]
method: RPBEPBE
basis: SDD
operation: Freq
keyword: #pfreq=noraman
keyword: PBEPBE/SDD
title: #p freq=noraman PBEPBE/SDD
converged: NO NO NO NO
title: Mulliken charges:
elementType: O N C C C C C C H H H H H H H
charge: -0.279234 -0.385794 0.379339 -0.368166 -0.782709 0.076986 -0.133549 -0.288605 0.328234 0.237024 0.243293 0.243291 0.249384 0.232454 0.248052
chargesum: 0.00000
title: Mulliken charges with hydrogens summed into heavy atoms:
elementType: O N C C C C C C
charge: -0.279234 -0.057561 0.379339 -0.131142 -0.046740 0.076986 0.098905 -0.040553
polarizability: 9.87758377e+01 -3.07222755e+00 8.46154445e+01 -3.76292925e-03 1.53976468e-03 3.59346671e+01
1716.lowfreq: -11.9398 -0.0010 -0.0009 -0.0007 13.0901 15.9502 119.2972 171.6033 201.5297
frequency: 119.2421 171.5959 201.5283 292.2221 416.9534 467.0491 511.4163 530.3840 574.7061 701.9188 719.1831 760.5742 793.9925 859.3060 892.5499 985.3211 987.9703 1008.8321 1050.9936 1067.0200 1152.7779 1212.1699 1234.6780 1339.1571 1395.4398 1404.0220 1420.5029 1467.4591 1476.3644 1549.0539 1612.5014 1657.1083 2977.6498 3053.5911 3108.4113 3135.6398 3177.6214 3185.2207 3494.9778
redmass: 1.0846 5.4726 2.7565 3.2317 2.9095 4.3204 5.4160 7.6366 3.0432 2.0083 6.4859 1.2908 1.6848 1.4309 2.9835 1.3087 4.0002 1.7927 1.5220 1.6977 1.3300 2.0870 2.4195 1.3431 2.2426 1.2355 2.7135 1.0433 1.1826 6.8979 4.1041 6.7550 1.0387 1.0980 1.0971 1.0891 1.0931 1.0975 1.0770
irintensity: 1.0848 1.1882 3.9511 1.6054 9.4121 4.5696 1.4586 4.1398 5.5292 36.3710 0.4777 6.5215 125.4065 1.6130 6.8791 0.6324 12.9447 1.6144 13.3846 4.3796 30.7662 6.0451 8.5413 2.4705 11.5719 17.5498 12.3214 16.7122 10.6962 24.7908 239.6330 333.6813 24.7557 14.8766 12.5008 16.2182 7.0338 4.1810 31.9273
temp: 298.150 k
press: 1.00000 atm
elementType: 8 7 6 6 6 6 6 6 1 1 1 1 1 1 1
symmnumber: 1
zpe: 312028.6 jmol-1
zpe.correction: 0.118845 hartree
zpe.thermalcorrener: 0.125888 hartree
zpe.thermalcorrenthalpy: 0.126832 hartree
zpe.thermalcorrgfe: 0.087606 hartree
zpe.sumelectzpe: -362.240995 hartree
zpe.sumelectthermal: -362.233952 hartree
zpe.sumelectthermalent: -362.233008 hartree
zpe.sumelectthermalfe: -362.272234 hartree
dipole: -5.0629 1.2767 0.0003
dipole: 5.2214
quadrupole: -50.5883 -42.5385 -49.5368
quadrupole: 8.8002 -0.0001 0.0000
quadrupole: -3.0338 5.0160 -1.9823 8.8002 -0.0001 0.0000
hfenergy: -362.3598401 hartree
pointgroup: C01 [X(C6H7N1O1)]
dipole: -2.011877 -0.415138 -0.0001311 debye
dipolederiv: -1.0516343 -0.3827643 -0.0000938 -0.6213744 -0.7874421 -0.0000762 0.0000427 0.0000322 -0.3946425 -0.7712324 -0.4357526 -0.0000179 0.2824883 -0.3487805 0.0000161 -0.0000446 -0.0000366 -0.2699677 0.3251249 0.2675785 0.0000262 -0.3689295 0.6920875 -0.0000165 0.0000151 0.0000287 0.058505 -0.3820818 0.1015118 -0.000005 0.4982207 -0.4122164 0.0000399 0.0000211 0.0000241 -0.2634722 -0.0926968 0.0285233 -0.000012 0.1352221 -0.0325407 0.0000103 -0.0000219 -0.0000025 0.0716052 1.3365542 0.5308746 0.0001064 0.7308384 0.8208936 0.0000824 0.000045 0.0000022 0.1867233 0.6146196 -0.0452032 0.0000562 -0.0559757 0.2593271 0.0000247 0.0000336 0.0000116 -0.069767 -0.2274723 -0.053824 -0.0000164 -0.5752456 -0.3757303 -0.0000385 -0.000034 -0.0000155 -0.2007702 0.1668995 -0.0098327 -0.0000139 0.0091188 0.1640822 -0.0000007 -0.0000189 0.0000065 0.3062288 -0.0561777 -0.0704315 -0.0000222 -0.0584543 0.061347 -0.000013 -0.0000225 -0.0000173 0.1859352 0.0496527 0.0233731 0.0225136 0.0584536 0.0100092 0.1048121 -0.0381617 0.1242 -0.0284136 0.0496497 0.0233908 -0.0225041 0.0584647 0.0100052 -0.1048078 0.0381741 -0.1241996 -0.0284106 -0.0289541 -0.0494565 -0.0000086 -0.1476555 0.0039096 -0.0000081 -0.0000091 -0.0000042 0.1231474 0.0943935 0.0088463 -0.0000012 0.0249377 -0.123604 -0.0000171 -0.0000106 -0.0000206 0.1457543 -0.0266447 0.0631665 -0.0000075 0.0298909 0.0586525 -0.0000074 -0.000008 -0.000009 0.1775446 unknown
polarizability: 99.0161948|2.4448435|84.3750874|0.0038264|0.0013745|35.9346671 unknown
InChI: InChI=1S/C6H7NO/c1-5-3-2-4-6(8)7-5/h2-4,7H,1H3
charge 0 multiplicity 1
15 atoms
O  2.252547 1.26029 0.000129
N  -0.069871 0.973048 0.000059
C  -1.241132 0.225279 -0.000048
C  -1.138654 -1.16192 -0.000087
C  -2.542367 0.992988 -0.000146
C  1.266432 0.454702 0.000203
C  0.164726 -1.769738 -0.000024
C  1.321176 -1.001958 0.000083
H  -0.122155 1.998044 0.000046
H  -2.046233 -1.7696 -0.000198
H  -2.627702 1.640849 -0.893496
H  -2.627823 1.640869 0.893179
H  -3.398282 0.299973 -0.000193
H  0.239449 -2.863482 -0.000099
H  2.320789 -1.445346 0.000091
