program: Gaussian 09
title: 000076797
version: EM64L-G09RevD.01
frameworkgroup: C1[X(C10H8Cl2O4)]
method: RPBEPBE
basis: SDD
operation: Freq
keyword: #p
keyword: freq=noraman
keyword: PBEPBE/SDD
title: #p freq=noraman PBEPBE/SDD
converged: YES YES NO NO
title: Mulliken charges:
elementType: Cl Cl O O O O C C C C C C C C C C H H H H H H H H
charge: 0.019498 0.019498 -0.294594 -0.294589 -0.211535 -0.211534 0.383414 0.383428 -0.323663 -0.323667 -0.296824 -0.296831 0.179476 0.179470 -0.494980 -0.494981 0.309822 0.309817 0.246919 0.246080 0.236387 0.246919 0.236388 0.246080
chargesum: 0.00000
title: Mulliken charges with hydrogens summed into heavy atoms:
elementType: Cl Cl O O O O C C C C C C C C C C
charge: 0.019498 0.019498 -0.294594 -0.294589 -0.211535 -0.211534 0.383414 0.383428 -0.323663 -0.323667 0.012998 0.012986 0.179476 0.179470 0.234406 0.234407
polarizability: 2.12786280e+02 -5.89331212e+00 1.72705720e+02 -8.82650432e-01 6.61855680e-01 6.38053732e+01
1716.lowfreq: -6.7912 -5.3363 -0.0031 -0.0028 -0.0027 5.1477 9.0031 11.2320 38.0913
frequency: 9.0031 10.5412 38.0913 94.1722 99.3603 103.6427 107.5833 123.9728 138.9280 178.0703 198.8415 213.8790 237.9420 271.2322 281.7494 319.2553 330.1735 344.4941 372.4542 447.8972 455.6479 551.4897 556.1933 595.0253 661.9997 666.9373 720.0244 745.8847 757.7390 760.6991 848.5171 916.3569 921.2139 931.2020 950.4956 1036.9924 1083.4211 1090.4073 1115.8375 1115.9009 1148.1077 1149.0386 1218.6516 1234.0322 1261.6340 1319.7982 1372.0661 1424.5211 1424.9574 1452.0837 1452.0941 1458.6826 1463.4392 1463.4818 1530.4584 1596.8119 1635.1431 1638.3542 3006.5794 3006.6979 3109.0861 3109.1117 3152.9957 3153.0059 3195.4847 3197.5702
redmass: 6.4986 7.8343 6.7087 2.3176 1.1757 3.5834 1.8022 2.8725 6.1090 4.6498 15.1176 5.3744 7.9939 6.1940 5.1282 21.6216 8.4432 8.7755 11.2411 3.5359 6.2791 9.6010 5.8944 9.3249 7.2273 6.8349 6.6558 9.1514 4.2967 6.0523 9.2456 7.4641 1.5222 1.4533 8.9407 9.2994 2.5917 8.8996 1.2634 1.2634 1.4523 1.4648 2.4171 6.2000 1.2623 8.3596 11.5583 1.1789 1.1735 1.0491 1.0492 3.0454 1.0570 1.0515 9.9599 8.4383 10.8001 10.3543 1.0296 1.0296 1.1046 1.1046 1.1049 1.1049 1.0918 1.0925
irintensity: 3.1633 0.0001 0.4036 1.1244 0.0000 1.3683 0.6649 0.0000 0.0000 16.1472 2.0230 0.0000 0.0000 0.0000 25.7906 0.0000 0.0000 0.0000 14.8293 2.5791 1.8193 25.0869 0.0001 55.8787 0.0000 0.0000 0.0000 15.6887 0.0000 2.1615 0.0000 30.6035 0.0000 30.5663 0.0000 412.7323 175.9470 0.0000 0.0000 0.0714 107.5251 0.0001 507.8980 0.0000 0.0000 37.8098 15.0274 47.4038 0.0002 0.0424 30.8324 113.7547 16.5181 0.0089 0.0000 0.0000 361.6203 0.0000 68.9364 0.0013 0.0264 46.6854 25.5491 0.2070 8.8892 0.0000
temp: 298.150 k
press: 1.00000 atm
elementType: 17 17 8 8 8 8 6 6 6 6 6 6 6 6 6 6 1 1 1 1 1 1 1 1
symmnumber: 1
zpe: 422145.1 jmol-1
zpe.correction: 0.160787 hartree
zpe.thermalcorrener: 0.177441 hartree
zpe.thermalcorrenthalpy: 0.178386 hartree
zpe.thermalcorrgfe: 0.111942 hartree
zpe.sumelectzpe: -1605.701481 hartree
zpe.sumelectthermal: -1605.684827 hartree
zpe.sumelectthermalent: -1605.683882 hartree
zpe.sumelectthermalfe: -1605.750326 hartree
dipole: 0.0001 -0.0001 0.0003
dipole: 0.0003
quadrupole: -86.9712 -109.0592 -105.0498
quadrupole: 24.5957 1.8997 -1.3659
quadrupole: 13.3889 -8.6992 -4.6897 24.5957 1.8997 -1.3659
hfenergy: -1605.8622679 hartree
pointgroup: C01 [X(C10H8Cl2O4)]
dipole: 0.0000231 -0.0000369 0.0001064 debye
dipolederiv: -0.1061462 0.1761153 0.0097233 0.2100195 -0.6845552 -0.0590943 0.0147861 -0.048489 -0.0231889 -0.10615 0.1761267 0.0097143 0.2100298 -0.6845482 -0.0590872 0.0147767 -0.0484693 -0.0231872 -1.236118 -0.3672159 -0.0987879 -0.7094094 -0.8534484 -0.1562732 -0.2046252 -0.1459188 -0.3350618 -1.2361292 -0.3671995 -0.0988485 -0.7093613 -0.853367 -0.1563768 -0.2047619 -0.1460114 -0.3351203 -0.8428594 0.239379 0.0620076 0.0179267 -0.6614639 -0.1117175 -0.0119765 -0.1058866 -0.3252266 -0.8428495 0.2393602 0.0620667 0.0179153 -0.6614231 -0.1118112 -0.0119837 -0.1059799 -0.3252765 -0.6211725 0.0378585 -0.0054946 0.049395 -0.0704056 -0.0212058 0.0042827 -0.0190943 0.0503235 -0.6211435 0.0378655 -0.0054914 0.0493996 -0.0703999 -0.0212163 0.0042941 -0.0190966 0.0503167 0.1692656 -0.5679982 -0.0480304 -0.2078924 0.9928371 0.090315 0.0005851 0.0848707 -0.0739404 0.1692535 -0.5680065 -0.0480237 -0.2079192 0.9928331 0.0902941 0.0006094 0.084845 -0.0739474 -0.0690236 0.2733252 0.0269876 -0.0064021 -0.3028397 -0.023152 -0.0236744 -0.0146777 -0.0637028 -0.0690296 0.2733276 0.0269946 -0.0063937 -0.3028307 -0.0231548 -0.0236949 -0.0146775 -0.0637036 1.8692407 0.1392335 0.0332101 0.5413962 1.2173517 0.287757 0.1627872 0.2544254 0.311259 1.8692352 0.1392365 0.0332036 0.5413772 1.2172275 0.2879749 0.1628943 0.2546121 0.3113745 0.7386228 0.1839567 0.0460896 0.1389311 0.2683215 0.0001752 0.0471839 0.0038795 0.2778338 0.7386228 0.1839388 0.046118 0.138907 0.2683135 0.0001714 0.0472066 0.0038722 0.2778303 0.1418712 -0.0115111 0.0011921 -0.0418907 0.0564293 -0.0093945 0.004682 -0.0118007 0.1570956 0.1418536 -0.0115147 0.0011929 -0.0418928 0.0564262 -0.0093936 0.0046921 -0.0118077 0.1570941 -0.0397391 -0.0318126 -0.0367511 0.0709991 0.022736 0.1129552 -0.0515466 0.0734998 -0.0037738 -0.0480327 -0.0455167 0.017271 0.0346305 0.0938082 -0.0561828 0.0810432 -0.0188443 -0.0813575 0.0440997 -0.0258121 -0.0074194 -0.0976979 -0.0787737 -0.0541788 -0.0235303 -0.0519574 0.1097432 -0.0397384 -0.0318044 -0.036756 0.0710096 0.0227064 0.1129582 -0.0515323 0.0735071 -0.0037423 0.0440957 -0.0258156 -0.0074258 -0.0976975 -0.0787545 -0.0542051 -0.0235434 -0.051983 0.1097284 -0.0480291 -0.045516 0.0172576 0.0346203 0.0938196 -0.056157 0.0810459 -0.0188175 -0.0813699 unknown
polarizability: 211.8712013|-8.5753313|171.8865931|1.6569675|13.5255657|65.5395785 unknown
InChI: InChI=1S/C10H8Cl2O4/c1-15-9(13)5-3-8(12)6(4-7(5)11)10(14)16-2/h3-4H,1-2H3
charge 0 multiplicity 1
24 atoms
Cl -1.188426 2.977056 0.269089
Cl 1.188135 -2.975806 -0.269405
O  -3.499037 -1.00768 -0.304687
O  3.498755 1.008829 0.304535
O  -3.625123 1.244357 0.261154
O  3.624779 -1.243099 -0.261755
C  -1.433484 0.149747 0.0000
C  1.433169 -0.148506 -0.00034
C  -0.576934 1.27841 0.122897
C  0.57662 -1.277166 -0.123235
C  -0.81965 -1.12455 -0.123123
C  0.819336 1.125791 0.122788
C  -2.931142 0.235082 0.009154
C  2.930826 -0.23386 -0.009535
C  -4.980309 -1.040037 -0.310189
C  4.980031 1.041157 0.309992
H  -1.463789 -2.000303 -0.218725
H  1.463475 2.001543 0.218396
H  -5.373553 -0.32291 -1.049956
H  -5.370636 -0.780384 0.688141
H  -5.235945 -2.073377 -0.581985
H  5.373282 0.32391 1.049639
H  5.235697 2.07445 0.581938
H  5.370321 0.781646 -0.688389
