program: Gaussian 09
title: 000076845
version: EM64L-G09RevD.01
frameworkgroup: C1[X(C20H13NO5)]
method: RPBEPBE
basis: SDD
operation: Freq
keyword: #p
keyword: freq=noraman
keyword: PBEPBE/SDD
title: #p freq=noraman PBEPBE/SDD
converged: NO YES NO NO
title: Mulliken charges:
elementType: O O O O O N C C C C C C C C C C C C C C C C C C C C H H H H H H H H H H H H H
charge: -0.226351 -0.274210 -0.221445 -0.426150 -0.426406 -0.702977 -0.064915 0.286282 0.352584 0.348162 0.145485 0.159794 0.158040 0.085107 -0.405365 -0.330637 -0.324850 -0.605382 -0.549047 -0.514055 -0.424285 0.544969 -0.395744 -0.432518 0.314848 0.323557 0.252920 0.251723 0.250300 0.262112 0.256344 0.283984 0.223546 0.255370 0.224500 0.316240 0.310596 0.359260 0.358616
chargesum: 0.00000
title: Mulliken charges with hydrogens summed into heavy atoms:
elementType: O O O O O N C C C C C C C C C C C C C C C C C C C C
charge: -0.226351 -0.274210 -0.221445 -0.066890 -0.067791 -0.076142 -0.064915 0.286282 0.352584 0.348162 0.145485 0.159794 0.158040 0.085107 -0.152445 -0.078915 -0.074550 -0.343270 -0.292703 -0.230072 -0.200739 0.544969 -0.140374 -0.208017 0.314848 0.323557
polarizability: 3.13781894e+02 1.77091394e+00 2.76864952e+02 6.94057007e+00 1.64452937e-01 1.65657784e+02
1716.lowfreq: -0.0004 0.0002 0.0009 1.0337 3.5969 6.1909 33.1993 38.8104 46.1802
frequency: 33.1952 38.8004 46.1769 56.1775 99.3187 126.2593 132.7262 168.7347 174.2738 188.4799 216.0609 241.7558 267.5776 274.8322 298.2123 320.3803 344.7231 346.1851 351.9726 372.6219 380.2969 381.7438 385.2805 408.2717 412.2231 422.1145 460.8828 463.7453 473.4052 495.5159 524.4371 526.6508 577.2284 588.9147 592.0311 597.2480 611.0191 620.7566 656.1563 681.2064 694.0646 710.3602 719.2062 736.1279 744.1636 749.1450 754.0935 774.3129 803.7014 825.9064 828.2955 838.0500 863.7246 875.2343 889.3957 909.4512 913.8199 942.9415 944.9554 954.5204 962.2595 975.4941 1017.1258 1039.5204 1087.3406 1101.1426 1115.2598 1132.3760 1145.4968 1162.3564 1169.9205 1178.1885 1190.7420 1217.0877 1244.1739 1255.1675 1271.2705 1276.6588 1288.0185 1308.5152 1333.8639 1396.8623 1399.5486 1408.4438 1430.7556 1451.0707 1457.5016 1494.8249 1499.1231 1507.0758 1583.3126 1594.0128 1603.3669 1628.5717 1637.8569 1646.0472 1648.2628 1679.8765 3123.7849 3125.1650 3141.3562 3146.0126 3147.4316 3150.9600 3154.7376 3181.0854 3188.5250 3565.8013 3582.8384 3586.7608 3705.3530
redmass: 5.0022 5.8236 7.3044 7.7903 5.0713 4.8058 6.6798 5.4410 6.4476 5.5972 7.9541 9.4899 6.3560 6.5304 5.9165 7.9376 5.4408 5.6229 1.1202 1.1460 3.0582 3.7166 1.2668 1.2573 4.4901 2.6971 3.2293 4.4208 3.4187 9.1345 6.3149 5.7683 4.1898 6.9850 8.1951 7.6222 4.1451 4.5825 5.9912 4.8121 4.7523 7.0179 3.5173 7.8721 7.7982 6.9980 4.8394 2.4160 1.7242 1.5633 1.7663 1.6649 1.5823 5.0178 1.6169 5.2016 4.6944 2.0590 2.3671 1.4196 1.3527 3.0580 2.5359 1.9011 2.5464 1.9204 2.0716 1.6031 1.3615 1.3076 1.6312 2.2363 1.7083 1.7625 1.8964 2.4376 2.3313 4.3287 1.9099 2.1170 3.0957 7.3541 5.9037 7.5369 4.0249 4.0591 4.4113 3.1790 3.1782 3.8481 7.2937 8.0845 7.8276 7.0648 2.3981 6.6268 1.7580 12.9502 1.0882 1.0887 1.0924 1.0911 1.0906 1.0964 1.0955 1.0958 1.0930 1.0451 1.0661 1.0661 1.1041
irintensity: 0.1647 0.9293 2.5313 2.3136 1.7873 1.1154 0.8027 0.6804 1.3592 2.0103 4.8498 1.5250 2.7974 3.4694 3.5985 1.2154 8.0431 10.7083 134.0635 138.6431 37.1662 0.8803 21.0425 248.3611 18.1356 1.1334 16.5022 13.0928 3.2933 20.5496 17.2575 1.4105 22.3423 12.1385 7.3549 4.5625 1.8865 10.4540 17.0522 15.7897 2.1395 25.9320 1.8519 6.4396 1.8970 29.6635 5.1604 113.1545 19.6804 32.7871 20.9765 61.6757 40.5788 39.6310 27.4298 2.3030 5.0968 9.6007 0.8130 0.1926 3.0237 102.7856 113.6569 53.6743 67.0430 273.6684 6.0240 441.1470 67.7467 55.7343 44.5211 15.8596 54.4531 14.7891 1.1414 62.2515 8.0177 26.7881 31.6958 69.0702 151.1833 83.2443 21.6449 23.7724 143.7788 85.1689 19.5825 96.4874 35.1282 141.1347 24.3246 14.3356 135.8565 301.7053 0.8063 113.3885 257.5526 396.0426 15.8318 12.3884 9.8787 7.6169 0.7986 11.6409 7.6532 4.1617 0.1350 102.3993 59.1925 58.7755 24.1399
temp: 298.150 k
press: 1.00000 atm
elementType: 8 8 8 8 8 7 6 6 6 6 6 6 6 6 6 6 6 6 6 6 6 6 6 6 6 6 1 1 1 1 1 1 1 1 1 1 1 1 1
symmnumber: 1
zpe: 742685.8 jmol-1
zpe.correction: 0.282874 hartree
zpe.thermalcorrener: 0.303683 hartree
zpe.thermalcorrenthalpy: 0.304627 hartree
zpe.thermalcorrgfe: 0.233966 hartree
zpe.sumelectzpe: -1199.038145 hartree
zpe.sumelectthermal: -1199.017337 hartree
zpe.sumelectthermalent: -1199.016393 hartree
zpe.sumelectthermalfe: -1199.087054 hartree
dipole: 3.0391 1.6391 -6.4334
dipole: 7.3014
quadrupole: -109.1672 -132.5458 -163.5187
quadrupole: 8.6057 -14.1147 -0.1843
quadrupole: 25.9100 2.5314 -28.4415 8.6057 -14.1147 -0.1843
hfenergy: -1199.3210193 hartree
pointgroup: C01 [X(C20H13N1O5)]
dipole: 1.1295498 0.6803963 -2.5520657 debye
polarizability: 314.0443026|1.7169292|276.8382658|3.0962578|1.6840609|165.4220611 unknown
InChI: InChI=1S/C20H13NO5/c21-10-1-4-14-13(7-10)19(24)26-20(14)15-5-2-11(22)8-17(15)25-18-9-12(23)3-6-16(18)20/h1-9,22-23H,21H2
charge 0 multiplicity 1
39 atoms
O  0.400953 -0.016565 1.860147
O  -2.907852 0.007736 0.015267
O  2.348117 -0.025567 3.153662
O  -3.031739 -4.81773 -0.38065
O  -3.150783 4.758891 -0.259118
N  5.522518 0.005337 -1.376834
C  0.038625 0.000354 0.32834
C  1.42426 0.006422 -0.307431
C  -0.774261 -1.249645 0.066163
C  -0.77195 1.258856 0.096839
C  2.431217 -0.004369 0.676766
C  -2.185463 -1.199365 -0.024463
C  -2.186591 1.216373 0.004835
C  1.807896 -0.016839 2.030357
C  1.787199 0.017304 -1.667633
C  -0.164964 -2.530186 -0.008929
C  -0.159216 2.535593 0.055693
C  3.800439 -0.004588 0.366356
C  -2.974003 -2.359117 -0.175279
C  -2.971585 2.37844 -0.114367
C  3.154777 0.017235 -2.009821
C  4.179353 0.00596 -1.007046
C  -0.918178 -3.702964 -0.158933
C  -0.912189 3.715339 -0.062978
C  -2.331599 -3.611826 -0.23599
C  -2.328236 3.628906 -0.142213
H  1.025067 0.024263 -2.454017
H  0.925452 -2.598875 0.062464
H  0.931393 2.598921 0.12814
H  4.545642 -0.014296 1.169712
H  -4.062309 -2.253672 -0.242708
H  -4.059144 2.308638 -0.183079
H  3.447308 0.024448 -3.067042
H  -0.446557 -4.687608 -0.208387
H  -0.411293 4.690832 -0.086002
H  6.255278 -0.008141 -0.673495
H  5.796187 0.006605 -2.354905
H  -4.00888 -4.664464 -0.401764
H  -2.613888 5.589565 -0.246856
