program: Gaussian 09
title: 000076755
version: EM64L-G09RevD.01
frameworkgroup: C1[X(C2H2ClNS)]
method: RPBEPBE
basis: SDD
operation: Freq
keyword: #p
keyword: freq=noraman
keyword: PBEPBE/SDD
title: #p freq=noraman PBEPBE/SDD
converged: NO NO NO NO
title: Mulliken charges:
elementType: Cl S N C C H H
charge: 0.015492 0.363099 0.033080 -0.701928 -0.361610 0.325925 0.325942
chargesum: 0.00000
title: Mulliken charges with hydrogens summed into heavy atoms:
elementType: Cl S N C C
charge: 0.015492 0.363099 0.033080 -0.050061 -0.361610
polarizability: 8.70000038e+01 8.07289182e+00 3.93836432e+01 2.27653479e-02 -1.86726634e-02 2.39937482e+01
1716.lowfreq: -0.2388 -0.0041 -0.0036 0.0019 6.5256 21.2280 34.9639 111.7894 231.9342
frequency: 34.4095 111.7696 231.9334 377.3187 410.4361 615.0115 652.5600 689.8635 855.6644 1105.1487 1244.0738 1412.6766 2094.8022 3084.0475 3191.7501
redmass: 3.9170 12.7852 17.2888 12.6477 11.2017 13.5589 10.7565 8.0356 1.3051 1.0202 1.1086 1.0701 12.7190 1.0523 1.1175
irintensity: 10.3010 8.0446 0.3666 0.0725 3.9178 8.0726 11.0631 61.0949 3.9612 0.0422 41.0818 1.4605 14.1482 4.0517 1.7450
temp: 298.150 k
press: 1.00000 atm
elementType: 17 16 7 6 6 1 1
symmnumber: 1
zpe: 96368.0 jmol-1
zpe.correction: 0.036705 hartree
zpe.thermalcorrener: 0.042773 hartree
zpe.thermalcorrenthalpy: 0.043717 hartree
zpe.thermalcorrgfe: 0.005169 hartree
zpe.sumelectzpe: -989.859497 hartree
zpe.sumelectthermal: -989.853429 hartree
zpe.sumelectthermalent: -989.852485 hartree
zpe.sumelectthermalfe: -989.891033 hartree
dipole: 2.2222 -0.6334 0.0185
dipole: 2.3108
quadrupole: -57.0863 -41.9942 -43.0383
quadrupole: -3.7646 -0.0048 -0.0177
quadrupole: -9.7134 5.3787 4.3346 -3.7646 -0.0048 -0.0177
hfenergy: -989.8962016 hartree
pointgroup: C01 [X(C2H2Cl1N1S1)]
dipole: 0.8645629 -0.2811292 0.0070622 debye
dipolederiv: -0.5371467 -0.0049837 0.0009695 -0.0614531 -0.113239 0.0005236 0.0020412 0.000056 -0.1059783 -0.2473559 0.0332162 -0.0003571 -0.0403334 0.2539031 0.0003507 -0.0001388 -0.0003579 0.0855099 -0.3235863 -0.0220963 0.0002439 -0.0833751 -0.1908069 0.000193 -0.0004026 -0.0000034 -0.1812464 1.0470275 -0.1824598 -0.0013565 -0.1644527 0.2182674 -0.0014996 -0.0020519 -0.0006831 0.1979846 0.2046041 0.1723257 0.0001957 0.2263847 -0.149114 -0.0000242 0.00056 0.0002966 -0.0457282 -0.0715684 0.0014784 -0.0263619 0.0611892 -0.0101363 -0.0655818 -0.0174171 -0.0413471 0.0256296 -0.0719743 0.0025195 0.0266664 0.0620404 -0.0088742 0.0660383 0.0174092 0.0420388 0.0238289 unknown
polarizability: 87.5281346|6.3043639|38.8554695|-0.0158816|-0.0352439|23.9937911 unknown
InChI: InChI=1S/C2H2ClNS/c3-1-5-2-4/h1H2
charge 0 multiplicity 1
7 atoms
Cl 2.895186 -0.04936 -0.004449
S  0.027893 0.957367 0.000889
N  -2.592902 -0.388646 -0.002332
C  1.133017 -0.610743 0.006343
C  -1.516283 0.142306 -0.00009
H  0.943931 -1.19032 -0.905014
H  0.951858 -1.178703 0.926554
