program: Gaussian 09
title: 000076764
version: EM64L-G09RevD.01
frameworkgroup: C1[X(C5H8O4S2)]
method: RPBEPBE
basis: SDD
operation: Freq
keyword: #pfreq=noraman
keyword: PBEPBE/SDD
title: #p freq=noraman PBEPBE/SDD
converged: NO YES NO NO
title: Mulliken charges:
elementType: S S O O O O C C C C C H H H H H H H H
charge: 0.931023 0.931023 -0.509510 -0.509474 -0.509525 -0.509459 -0.716579 -0.192496 -0.192497 -0.425163 -0.425162 0.296049 0.295953 0.252587 0.252588 0.246652 0.268670 0.246652 0.268670
chargesum: 0.00000
title: Mulliken charges with hydrogens summed into heavy atoms:
elementType: S S O O O O C C C C C
charge: 0.931023 0.931023 -0.509510 -0.509474 -0.509525 -0.509459 -0.124577 0.060091 0.060091 0.090159 0.090160
polarizability: 1.84044057e+02 -1.40570445e-04 9.96741741e+01 7.33777947e-03 -1.79319467e-04 8.89688220e+01
1716.lowfreq: -123.5395 -118.8827 -31.2864 -4.1572 -2.4403 -0.0011 0.0008 0.0021 7.0359
frequency: -123.5387 -118.8825 -31.2781 55.1732 68.0133 121.0782 134.7009 153.6876 207.0408 213.7077 215.9721 247.3254 249.7295 323.9066 328.3199 414.0691 425.4282 503.4969 528.8271 547.0784 547.3745 555.3498 572.7268 781.5521 792.3830 818.3868 890.7131 892.5558 916.4621 967.9621 968.6564 973.6771 976.8856 977.6218 1090.4725 1143.4225 1203.7879 1211.3147 1297.4036 1393.6495 1393.6894 1610.6254 1610.8798 3054.1930 3097.7600 3097.7657 3162.4570 3162.7415 3189.5143 3207.4722 3207.4856
redmass: 1.9855 1.9663 9.9204 5.1013 4.9281 6.0376 8.3543 11.3125 3.8532 5.6841 3.5747 4.5865 2.3308 10.0307 9.6644 4.9773 3.9283 4.8136 14.2419 1.9524 1.8956 6.6996 5.5997 1.7446 15.6214 12.2303 1.1164 1.1007 5.1636 1.2280 2.7063 1.2768 1.2786 1.9013 1.1788 1.2051 1.2631 1.2293 1.0800 1.1715 1.1713 4.4211 4.4239 1.0481 1.0589 1.0589 1.1021 1.1024 1.1183 1.1147 1.1147
irintensity: 0.0000 0.0181 0.0000 0.0364 1.5814 0.3578 0.2922 0.0000 0.0040 26.2501 0.0000 0.4144 0.0196 25.0608 0.3570 39.1071 0.0015 33.4499 0.3028 0.0000 64.7941 329.1858 21.6136 0.1302 15.8433 108.4597 0.0000 21.6059 0.0001 23.5601 5.3481 0.0002 0.4670 313.2473 0.0000 7.9087 8.6409 16.1847 3.0090 36.6580 10.5151 3.5388 1.4387 0.0100 0.3247 0.7368 2.4966 2.6175 1.7085 0.2889 0.4459
temp: 298.150 k
press: 1.00000 atm
elementType: 16 16 8 8 8 8 6 6 6 6 6 1 1 1 1 1 1 1 1
symmnumber: 1
zpe: 320028.0 jmol-1
zpe.correction: 0.121892 hartree
zpe.thermalcorrener: 0.134196 hartree
zpe.thermalcorrenthalpy: 0.135141 hartree
zpe.thermalcorrgfe: 0.083051 hartree
zpe.sumelectzpe: -1291.042772 hartree
zpe.sumelectthermal: -1291.030467 hartree
zpe.sumelectthermalent: -1291.029523 hartree
zpe.sumelectthermalfe: -1291.081612 hartree
dipole: 0.0000 9.8508 -0.0057
dipole: 9.8508
quadrupole: -52.6745 -78.8866 -97.4788
quadrupole: 0.0001 0.0156 -0.0122
quadrupole: 23.6721 -2.5400 -21.1322 0.0001 0.0156 -0.0122
hfenergy: -1291.1646639 hartree
pointgroup: C01 [X(C5H8O4S2)]
dipole: -0.0000781 -3.8754451 0.0331406 debye
dipolederiv: 2.0398692 -0.0178528 0.0002846 -0.4799155 1.128604 0.0004951 0.0046201 0.0006139 1.1858693 2.0398936 0.0178206 0.0000497 0.4798786 1.128582 0.000665 -0.0044537 0.0005011 1.1858684 -0.5898442 0.0284001 0.0437147 0.0007489 -0.4876598 0.0038184 0.0779708 -0.1164773 -0.5544928 -0.5898127 0.0276622 -0.0442702 -0.000682 -0.485538 -0.0051952 -0.0779737 0.115159 -0.5565712 -0.5898823 -0.0284133 -0.0437662 -0.0006983 -0.4874992 0.0039199 -0.0779726 -0.1164172 -0.5547241 -0.5897788 -0.0276415 0.0442186 0.000639 -0.4856918 -0.0050909 0.0779907 0.1152156 -0.5563415 -0.9129636 0.0000086 -0.0001929 0.0000095 -0.3320893 0.0010997 -0.0003067 0.0010717 -0.2257523 -0.1637265 0.0990815 -0.0008485 0.2235449 0.0120149 -0.0033662 -0.001998 -0.0033984 -0.3645666 -0.1637524 -0.0990718 0.0006469 -0.223534 0.0120326 -0.0030698 0.001854 -0.003032 -0.3645722 -0.2394999 -0.0771384 0.0006886 -0.2682631 -0.0407726 -0.0016605 0.0023581 -0.0016163 -0.2227258 -0.2394784 0.0771454 -0.000651 0.2682703 -0.0407815 -0.0014735 -0.0021052 -0.0014527 -0.2227276 -0.1047388 -0.0000115 -0.0000239 -0.0000298 0.0150155 0.0434507 -0.0000271 0.0283403 0.045325 -0.1047263 0.0000163 -0.0000257 0.0000351 0.0136468 -0.0429493 -0.0000282 -0.0278444 0.0465326 -0.0478822 -0.0099047 0.0000352 -0.0448 -0.0495985 0.0022678 0.0003597 0.0022759 0.2041182 -0.0478777 0.0099027 0.000025 0.0447986 -0.0496033 0.002006 -0.0003031 0.0020203 0.2041224 -0.0086375 -0.1046545 0.0009065 -0.0315666 0.0536922 0.0013727 0.0002592 0.0013604 0.2075506 0.1607353 0.0102738 -0.0000938 0.0323384 0.020982 0.0013166 -0.0002702 0.0013081 0.1677662 -0.0086299 0.1046572 -0.0007893 0.0315704 0.0536827 0.0012155 -0.0002301 0.0012055 0.2075528 0.1607331 -0.0102797 0.0000918 -0.0323442 0.0209814 0.0011782 0.000256 0.0011665 0.1677684 unknown
polarizability: 184.0440579|-0.0016329|99.6734909|-0.0000521|-0.0855223|88.9695047 unknown
InChI: InChI=1S/C5H8O4S2/c1-3-10(6,7)5-11(8,9)4-2/h3-4H,1-2,5H2
charge 0 multiplicity 1
19 atoms
S  -1.639279 0.343682 -0.003411
S  1.639329 0.34362 -0.002493
O  -1.74725 1.147356 1.407081
O  -1.74619 1.121358 -1.428462
O  1.747413 1.14579 1.40885
O  1.746197 1.122807 -1.426719
C  0.0000 -0.737279 0.006988
C  -2.901709 -1.10011 0.009369
C  2.901688 -1.100237 0.008718
C  -4.213178 -0.808725 0.006586
C  4.213171 -0.808912 0.006057
H  -0.000212 -1.30181 0.95108
H  0.000189 -1.318993 -0.92662
H  -2.433985 -2.090118 0.018362
H  2.433919 -2.090231 0.016801
H  -4.961861 -1.61005 0.013657
H  -4.582892 0.222814 -0.002658
H  4.961817 -1.610279 0.012257
H  4.582933 0.222617 -0.002242
