program: Gaussian 09
title: 000076813
version: EM64L-G09RevD.01
frameworkgroup: C1[X(C8H19O2PS3)]
method: RPBEPBE
basis: SDD
operation: Freq
keyword: #p
keyword: freq=noraman
keyword: PBEPBE/SDD
title: #p freq=noraman PBEPBE/SDD
converged: YES YES NO NO
title: Mulliken charges:
elementType: S S S P O O C C C C C C C C H H H H H H H H H H H H H H H H H H H
charge: 0.081557 0.219246 -0.232393 0.559842 -0.471158 -0.480946 -0.328447 -0.602289 -0.848130 -0.673042 -0.216973 -0.204326 -0.651613 -0.655272 0.221686 0.210225 0.246915 0.276321 0.332360 0.307887 0.208133 0.222854 0.215898 0.236209 0.219076 0.228222 0.231104 0.213032 0.229956 0.230750 0.214687 0.225652 0.232978
chargesum: 0.00000
title: Mulliken charges with hydrogens summed into heavy atoms:
elementType: S S S P O O C C C C C C C C
charge: 0.081557 0.219246 -0.232393 0.559842 -0.471158 -0.480946 0.103464 -0.079054 -0.207884 -0.026157 0.238312 0.255000 0.022125 0.018044
polarizability: 2.26660262e+02 1.45920020e+01 1.77636270e+02 1.70661085e+01 1.08943483e+01 1.51831693e+02
1716.lowfreq: -12.7330 -8.9539 -4.3057 0.0017 0.0021 0.0024 14.3611 23.1361 27.4403
frequency: 12.0663 22.4241 27.3994 30.2776 35.9435 48.3381 56.9522 66.1037 68.2340 98.0013 114.1997 124.4830 133.3373 178.0291 206.9914 213.2696 217.9313 229.4978 242.9640 257.5366 285.0006 288.9509 316.4484 320.9589 332.8261 404.6211 452.5529 544.4987 579.5917 659.3610 668.5586 687.4380 691.2371 746.3273 808.8544 809.9809 826.6514 855.2838 860.5614 872.8911 904.3683 1016.3166 1024.4504 1047.5286 1059.1435 1102.9195 1103.9735 1104.4496 1131.0489 1134.0071 1154.4051 1220.4564 1232.9932 1251.9683 1254.0258 1265.0019 1287.6896 1336.8423 1352.0886 1354.3264 1390.5196 1393.3929 1394.4566 1396.2033 1445.6669 1457.8229 1458.2326 1475.0475 1476.3675 1477.6857 1478.4209 1486.1826 1488.0027 1488.5735 2977.3561 2981.3257 2989.3515 2991.5632 2994.7622 2995.1804 3013.5639 3038.5821 3045.4070 3058.3048 3060.3273 3074.0237 3079.3442 3089.8835 3091.3917 3094.0124 3107.1151 3107.8719 3153.9961
redmass: 4.1749 3.9946 2.9205 1.9638 2.7720 2.5438 2.3850 3.4264 3.2291 5.2625 4.1149 5.6204 3.9568 3.6331 2.7695 3.3852 2.3290 1.2677 1.3774 1.8574 3.6175 4.6702 5.8488 5.5402 3.8841 5.8045 8.5885 11.5766 9.0222 6.6250 6.9037 5.8693 5.6990 1.0877 1.0879 1.0925 1.5587 1.1917 4.2159 3.6596 1.8795 2.4550 2.7021 2.8095 1.1980 2.2235 2.2151 1.9115 1.4087 1.4377 1.1112 1.3727 1.1015 1.1495 1.1362 1.2057 1.1020 1.4229 1.2541 1.2597 1.2033 1.1748 1.2336 1.1369 1.0909 1.0401 1.0404 1.0508 1.0523 1.0502 1.0458 1.0821 1.0784 1.0786 1.0352 1.0558 1.0608 1.0455 1.0460 1.0376 1.0570 1.1005 1.1077 1.1078 1.0547 1.1017 1.0995 1.0983 1.0982 1.1075 1.1025 1.1020 1.1117
irintensity: 0.1579 0.2582 0.3695 0.6962 0.4428 2.1893 0.8348 0.5035 2.1816 2.7931 1.3510 2.6348 0.2120 2.8935 1.6561 7.5983 1.7512 0.5844 2.3657 3.7337 6.8000 0.0799 6.3123 1.2448 0.3284 9.9991 50.5782 159.3062 10.1131 98.6932 48.2696 69.5111 22.5629 8.0735 2.6517 2.7575 5.6490 0.7842 181.1167 91.9324 14.0984 127.0728 93.1101 1.7199 1.9785 10.9508 15.1001 8.7267 4.6933 4.6146 1.2124 2.7644 23.1479 0.4446 0.0690 5.0730 0.7122 3.2077 5.0855 9.7862 10.0079 26.4453 26.3208 5.3832 7.3957 13.9523 13.6434 3.2960 3.8665 10.1283 18.5816 19.4913 0.5689 10.5850 30.6397 30.7599 22.0505 20.1224 26.3342 25.1218 20.0418 2.0813 11.3109 8.0763 7.5350 31.0390 54.8654 29.0542 27.4156 39.2101 34.7059 31.4666 0.4860
temp: 298.150 k
press: 1.00000 atm
elementType: 16 16 16 15 8 8 6 6 6 6 6 6 6 6 1 1 1 1 1 1 1 1 1 1 1 1 1 1 1 1 1 1 1
symmnumber: 1
zpe: 693741.5 jmol-1
zpe.correction: 0.264232 hartree
zpe.thermalcorrener: 0.285762 hartree
zpe.thermalcorrenthalpy: 0.286706 hartree
zpe.thermalcorrgfe: 0.207956 hartree
zpe.sumelectzpe: -2000.934920 hartree
zpe.sumelectthermal: -2000.913390 hartree
zpe.sumelectthermalent: -2000.912446 hartree
zpe.sumelectthermalfe: -2000.991196 hartree
dipole: 0.3305 0.8707 -3.7295
dipole: 3.8440
quadrupole: -109.0183 -112.7171 -123.1879
quadrupole: -10.5515 -6.8270 -3.3100
quadrupole: 5.9561 2.2573 -8.2135 -10.5515 -6.8270 -3.3100
hfenergy: -2001.1991517 hartree
pointgroup: C01 [X(C8H19O2P1S3)]
dipole: 0.4558815 0.5392146 -1.3373971 debye
polarizability: 221.8072219|-4.7292031|171.0061677|31.0023776|8.5964669|163.314835 unknown
InChI: InChI=1S/C8H19O2PS3/c1-4-7-13-8-14-11(12,9-5-2)10-6-3/h4-8H2,1-3H3
charge 0 multiplicity 1
33 atoms
S  -0.795948 -1.969436 0.896485
S  -3.171375 -1.629777 -1.118234
S  2.028247 -0.189472 2.525916
P  1.00064 -0.57933 0.778267
O  1.956382 -1.178254 -0.562667
O  0.263951 0.740317 -0.080367
C  -4.605349 0.687113 -0.377843
C  -3.173586 0.222274 -0.68926
C  -1.353434 -1.966421 -0.945935
C  -4.642128 2.197197 -0.046676
C  2.949863 -2.254392 -0.284658
C  1.125175 1.922993 -0.400218
C  3.684626 -2.506978 -1.598168
C  0.201429 2.959034 -1.032431
H  -5.000624 0.105358 0.476291
H  -5.267076 0.480955 -1.241852
H  -2.744447 0.769012 -1.547025
H  -2.506355 0.345272 0.181557
H  -0.750384 -1.211806 -1.470728
H  -1.164423 -2.971419 -1.3477
H  -4.275488 2.802207 -0.897188
H  -5.672399 2.524306 0.182289
H  -4.010125 2.426818 0.831201
H  3.633828 -1.913963 0.516072
H  2.411061 -3.157441 0.063594
H  1.58033 2.291978 0.538761
H  1.923539 1.598743 -1.092988
H  4.435637 -3.306321 -1.457794
H  2.981469 -2.823195 -2.387314
H  4.204975 -1.59501 -1.936761
H  0.779454 3.866642 -1.287135
H  -0.253982 2.566055 -1.957569
H  -0.604585 3.241241 -0.333921
